{"text_format":"1","workbook":"xlsx","n_sheets":10,"sheets":["Cover Sheet","GC-OTDOA","(3) SECTOR","(3) SECTOR Split or Add","Sweep-PIM","RET Screen Shot","Fiber OTDR Results","Feeder Misc","TMA-DIPLEXER","Sheet1"],"not_rendered":{"charts":0,"images":1,"macros":0,"external_links":3,"defined_names":22,"comments":0,"pivot_tables":0},"unopened":[],"bounds":{"document_bytes":16777216,"sheet_cells":100000,"rows_first":2000,"rows_last":500,"rows_between":2000,"halvings":0,"cell_chars":16384,"cell_head_chars":4096},"cells_cut":0,"cells_raw":0,"read":"whole","date_system":"1900"}

{"sheet":"Cover Sheet","index":0,"n_rows":24,"n_cols":2,"rows_kept":24,"cut":false,"hidden":false,"merged":[]}
[]
[]
[null,"RF Closeout to be filled out with all Closeout Packages on New Build, Co-Lo, TI, Antenna Mod, Service Improvement or Troubleshooting. "]
[]
[null,"Raw PIM & Sweep data submittals are still required and must be accompanied by this form –both .pdf and .dat format."]
[]
[null,"This template includes some of the following feature tabs to be used in its entirety:"]
[null,"·         Pre and Post PIM/Sweep Tab for 3 sector site"]
{"$rows_left_out":17}
{"sheet":"GC-OTDOA","index":1,"n_rows":101,"n_cols":28,"rows_kept":101,"cut":false,"hidden":false,"merged":[[66,1,66,2],[62,1,62,2],[63,1,63,2],[58,1,58,2],[59,1,59,2],[60,1,60,2],[61,1,61,2],[64,1,64,2],[0,0,0,1],[0,2,0,4],[56,1,56,2],[57,1,57,2],[65,1,65,2]]}
[null,null,null,null,null,"SURVEY DATA"]
["Band","Sector","EUtranCellFDD","Site Name","Ant. Height _AGL (Ft)","Mainline Feeder Type (Note if Hybrid Cable select \"Fiber\")","Mainline Length Estimate\n(feet)","Feeder Attenuation (dB)","Feeder delay (nsec)","Bottom Jumper Type","Bottm Jumper Length Estimate\n(feet)","Total Bottom Jumper Attenuation (dB)","Total Bottom Jumper Delay (nsec)","Top Jumper Type","Top Jumper Length Estimate (feet)","Total Top Jumper Attenuation (dB)","Total Jumper Delay (nsec)","TMA Type","TMA Delay DL (ENB CNTRLD not added to line calc)","TMA Delay UL (ENB CNTRLD not added to line calc)","Diplexer Type","Diplexer Delay","GPS Cable Type","GPS cable length Estimate (feet)","GPS Feeder Delay nsec","UL/DL Attenuation dB","RFBranch: dlTrafficDelay nsec","RFBranch: ulTrafficDelay nsec"]
[700,"WO",null,null,null,null,null,{"$f":"IF(OR(F3=\"Fiber\",F3=\"\"),0,VLOOKUP(F3,'Feeder Misc'!$B$4:$M$34,3,0)*'GC-OTDOA'!G3)","v":0},{"$f":"IF(OR(F3=\"Fiber\",F3=\"\"),0,(G3/VLOOKUP(F3,'Feeder Misc'!$B$3:$P$34,15,0)))","v":0},null,null,{"$f":"IF(OR(J3=\"Fiber\",J3=\"\"),0,VLOOKUP(J3,'Feeder Misc'!$B$4:$M$34,3,0)*'GC-OTDOA'!K3)","v":0},{"$f":"IF(OR(J3=\"Fiber\",J3=\"\"),0,(K3/VLOOKUP(J3,'Feeder Misc'!$B$3:$P$34,15,0)))","v":0},null,null,{"$f":"IF(OR(N3=\"Fiber\",N3=\"\"),0,VLOOKUP(N3,'Feeder Misc'!$B$4:$M$34,3,0)*'GC-OTDOA'!O3)","v":0},{"$f":"IF(OR(N3=\"Fiber\",N3=\"\"),0,(O3/VLOOKUP(N3,'Feeder Misc'!$B$3:$P$34,15,0)))","v":0},null,{"$f":"IF(R3=\"\",0,VLOOKUP(R3,'TMA-DIPLEXER'!B$1:P$6,15,0))","v":0},{"$f":"IF(R3=\"\",0,VLOOKUP(R3,'TMA-DIPLEXER'!B$1:Q$6,16,0))","v":0},null,{"$f":"IF(U3=\"\",0,VLOOKUP(U3,'TMA-DIPLEXER'!B$16:P$19,15,0))","v":0},null,null,{"$f":"ROUND(X3/VLOOKUP(W3,'Feeder Misc'!$B$3:$P$34,15,0)+9,0)","v":{"$error":"#N/A"}},{"$f":"ROUND(H3+L3+P3,1)","v":0},{"$f":"ROUND(I3+M3+Q3+V3,0)","v":0},{"$f":"ROUND(I3+M3+Q3+V3,0)","v":0}]
[700,"WOO",null,null,null,null,null,{"$f":"IF(OR(F4=\"Fiber\",F4=\"\"),0,VLOOKUP(F4,'Feeder Misc'!$B$4:$M$34,3,0)*'GC-OTDOA'!G4)","v":0},{"$f":"IF(OR(F4=\"Fiber\",F4=\"\"),0,(G4/VLOOKUP(F4,'Feeder Misc'!$B$3:$P$34,15,0)))","v":0},null,null,{"$f":"IF(OR(J4=\"Fiber\",J4=\"\"),0,VLOOKUP(J4,'Feeder Misc'!$B$4:$M$34,3,0)*'GC-OTDOA'!K4)","v":0},{"$f":"IF(OR(J4=\"Fiber\",J4=\"\"),0,(K4/VLOOKUP(J4,'Feeder Misc'!$B$3:$P$34,15,0)))","v":0},null,null,{"$f":"IF(OR(N4=\"Fiber\",N4=\"\"),0,VLOOKUP(N4,'Feeder Misc'!$B$4:$M$34,3,0)*'GC-OTDOA'!O4)","v":0},{"$f":"IF(OR(N4=\"Fiber\",N4=\"\"),0,(O4/VLOOKUP(N4,'Feeder Misc'!$B$3:$P$34,15,0)))","v":0},null,{"$f":"IF(R4=\"\",0,VLOOKUP(R4,'TMA-DIPLEXER'!B$1:P$6,15,0))","v":0},{"$f":"IF(R4=\"\",0,VLOOKUP(R4,'TMA-DIPLEXER'!B$1:Q$6,16,0))","v":0},null,{"$f":"IF(U4=\"\",0,VLOOKUP(U4,'TMA-DIPLEXER'!B$16:P$19,15,0))","v":0},null,null,null,{"$f":"ROUND(H4+L4+P4,1)","v":0},0,{"$f":"ROUND(I4+M4+Q4+V4,0)","v":0}]
[700,"BO",null,null,null,null,null,{"$f":"IF(OR(F5=\"Fiber\",F5=\"\"),0,VLOOKUP(F5,'Feeder Misc'!$B$4:$M$34,3,0)*'GC-OTDOA'!G5)","v":0},{"$f":"IF(OR(F5=\"Fiber\",F5=\"\"),0,(G5/VLOOKUP(F5,'Feeder Misc'!$B$3:$P$34,15,0)))","v":0},null,null,{"$f":"IF(OR(J5=\"Fiber\",J5=\"\"),0,VLOOKUP(J5,'Feeder Misc'!$B$4:$M$34,3,0)*'GC-OTDOA'!K5)","v":0},{"$f":"IF(OR(J5=\"Fiber\",J5=\"\"),0,(K5/VLOOKUP(J5,'Feeder Misc'!$B$3:$P$34,15,0)))","v":0},null,null,{"$f":"IF(OR(N5=\"Fiber\",N5=\"\"),0,VLOOKUP(N5,'Feeder Misc'!$B$4:$M$34,3,0)*'GC-OTDOA'!O5)","v":0},{"$f":"IF(OR(N5=\"Fiber\",N5=\"\"),0,(O5/VLOOKUP(N5,'Feeder Misc'!$B$3:$P$34,15,0)))","v":0},null,{"$f":"IF(R5=\"\",0,VLOOKUP(R5,'TMA-DIPLEXER'!B$1:P$6,15,0))","v":0},{"$f":"IF(R5=\"\",0,VLOOKUP(R5,'TMA-DIPLEXER'!B$1:Q$6,16,0))","v":0},null,{"$f":"IF(U5=\"\",0,VLOOKUP(U5,'TMA-DIPLEXER'!B$16:P$19,15,0))","v":0},null,null,null,0,0,0]
[700,"BOO",null,null,null,null,null,{"$f":"IF(OR(F6=\"Fiber\",F6=\"\"),0,VLOOKUP(F6,'Feeder Misc'!$B$4:$M$34,3,0)*'GC-OTDOA'!G6)","v":0},{"$f":"IF(OR(F6=\"Fiber\",F6=\"\"),0,(G6/VLOOKUP(F6,'Feeder Misc'!$B$3:$P$34,15,0)))","v":0},null,null,{"$f":"IF(OR(J6=\"Fiber\",J6=\"\"),0,VLOOKUP(J6,'Feeder Misc'!$B$4:$M$34,3,0)*'GC-OTDOA'!K6)","v":0},{"$f":"IF(OR(J6=\"Fiber\",J6=\"\"),0,(K6/VLOOKUP(J6,'Feeder Misc'!$B$3:$P$34,15,0)))","v":0},null,null,{"$f":"IF(OR(N6=\"Fiber\",N6=\"\"),0,VLOOKUP(N6,'Feeder Misc'!$B$4:$M$34,3,0)*'GC-OTDOA'!O6)","v":0},{"$f":"IF(OR(N6=\"Fiber\",N6=\"\"),0,(O6/VLOOKUP(N6,'Feeder Misc'!$B$3:$P$34,15,0)))","v":0},null,{"$f":"IF(R6=\"\",0,VLOOKUP(R6,'TMA-DIPLEXER'!B$1:P$6,15,0))","v":0},{"$f":"IF(R6=\"\",0,VLOOKUP(R6,'TMA-DIPLEXER'!B$1:Q$6,16,0))","v":0},null,{"$f":"IF(U6=\"\",0,VLOOKUP(U6,'TMA-DIPLEXER'!B$16:P$19,15,0))","v":0},null,null,null,0,0,0]
[700,"GO",null,null,null,null,null,{"$f":"IF(OR(F7=\"Fiber\",F7=\"\"),0,VLOOKUP(F7,'Feeder Misc'!$B$4:$M$34,3,0)*'GC-OTDOA'!G7)","v":0},{"$f":"IF(OR(F7=\"Fiber\",F7=\"\"),0,(G7/VLOOKUP(F7,'Feeder Misc'!$B$3:$P$34,15,0)))","v":0},null,null,{"$f":"IF(OR(J7=\"Fiber\",J7=\"\"),0,VLOOKUP(J7,'Feeder Misc'!$B$4:$M$34,3,0)*'GC-OTDOA'!K7)","v":0},{"$f":"IF(OR(J7=\"Fiber\",J7=\"\"),0,(K7/VLOOKUP(J7,'Feeder Misc'!$B$3:$P$34,15,0)))","v":0},null,null,{"$f":"IF(OR(N7=\"Fiber\",N7=\"\"),0,VLOOKUP(N7,'Feeder Misc'!$B$4:$M$34,3,0)*'GC-OTDOA'!O7)","v":0},{"$f":"IF(OR(N7=\"Fiber\",N7=\"\"),0,(O7/VLOOKUP(N7,'Feeder Misc'!$B$3:$P$34,15,0)))","v":0},null,{"$f":"IF(R7=\"\",0,VLOOKUP(R7,'TMA-DIPLEXER'!B$1:P$6,15,0))","v":0},{"$f":"IF(R7=\"\",0,VLOOKUP(R7,'TMA-DIPLEXER'!B$1:Q$6,16,0))","v":0},null,{"$f":"IF(U7=\"\",0,VLOOKUP(U7,'TMA-DIPLEXER'!B$16:P$19,15,0))","v":0},null,null,null,0,0,0]
[700,"GOO",null,null,null,null,null,{"$f":"IF(OR(F8=\"Fiber\",F8=\"\"),0,VLOOKUP(F8,'Feeder Misc'!$B$4:$M$34,3,0)*'GC-OTDOA'!G8)","v":0},{"$f":"IF(OR(F8=\"Fiber\",F8=\"\"),0,(G8/VLOOKUP(F8,'Feeder Misc'!$B$3:$P$34,15,0)))","v":0},null,null,{"$f":"IF(OR(J8=\"Fiber\",J8=\"\"),0,VLOOKUP(J8,'Feeder Misc'!$B$4:$M$34,3,0)*'GC-OTDOA'!K8)","v":0},{"$f":"IF(OR(J8=\"Fiber\",J8=\"\"),0,(K8/VLOOKUP(J8,'Feeder Misc'!$B$3:$P$34,15,0)))","v":0},null,null,{"$f":"IF(OR(N8=\"Fiber\",N8=\"\"),0,VLOOKUP(N8,'Feeder Misc'!$B$4:$M$34,3,0)*'GC-OTDOA'!O8)","v":0},{"$f":"IF(OR(N8=\"Fiber\",N8=\"\"),0,(O8/VLOOKUP(N8,'Feeder Misc'!$B$3:$P$34,15,0)))","v":0},null,{"$f":"IF(R8=\"\",0,VLOOKUP(R8,'TMA-DIPLEXER'!B$1:P$6,15,0))","v":0},{"$f":"IF(R8=\"\",0,VLOOKUP(R8,'TMA-DIPLEXER'!B$1:Q$6,16,0))","v":0},null,{"$f":"IF(U8=\"\",0,VLOOKUP(U8,'TMA-DIPLEXER'!B$16:P$19,15,0))","v":0},null,null,null,0,0,0]
{"$rows_left_out":94}
{"sheet":"(3) SECTOR","index":2,"n_rows":91,"n_cols":27,"rows_kept":91,"cut":false,"hidden":false,"merged":[[5,2,5,3],[5,6,5,7],[5,8,5,9],[5,10,5,11],[6,2,6,3],[6,6,6,7],[6,10,6,11],[1,1,1,11],[3,6,3,7],[3,8,3,9],[3,10,3,11],[4,6,4,7],[4,8,4,9],[4,10,4,11],[6,8,6,9],[3,2,3,3],[9,2,9,3],[9,6,9,7],[9,8,9,9],[9,10,9,11],[10,2,10,3],[10,6,10,7],[10,8,10,9],[10,10,10,11],[7,6,7,7],[7,8,7,9],[7,10,7,11],[8,2,8,3],[8,6,8,7],[8,8,8,9],[8,10,8,11],[9,4,9,5],[10,4,10,5],[15,4,15,5],[15,7,15,8],[15,10,15,11],[11,6,11,7],[11,8,11,9],[11,10,11,11],[13,1,15,2],[13,3,13,11],[14,3,14,5],[11,4,11,5],[14,9,14,11],[14,6,14,8],[18,1,18,2],[19,1,19,2],[20,1,20,2],[20,4,20,5],[20,7,20,8],[20,10,20,11],[16,1,16,2],[17,1,17,2],[17,4,17,5],[17,7,17,8],[17,10,17,11],[16,4,16,5],[16,7,16,8],[16,10,16,11],[23,1,23,2],[23,4,23,5],[23,7,23,8],[23,10,23,11],[21,1,21,11],[22,1,22,2],[22,4,22,5],[22,7,22,8],[22,10,22,11],[27,1,27,2],[27,4,27,5],[27,7,27,8],[27,10,27,11],[25,1,25,2],[25,4,25,5],[25,7,25,8],[25,10,25,11],[24,1,24,2],[24,4,24,5],[24,7,24,8],[24,10,24,11],[26,4,26,5],[26,7,26,8],[26,10,26,11],[30,1,30,2],[30,4,30,5],[30,7,30,8],[30,10,30,11],[28,1,28,2],[29,1,29,2],[29,4,29,5],[29,7,29,8],[29,10,29,11],[33,1,33,2],[33,4,33,5],[33,7,33,8],[33,10,33,11],[31,1,31,2],[32,1,32,2],[32,4,32,5],[32,7,32,8],[32,10,32,11],[36,1,36,2],[36,4,36,5],[36,7,36,8],[36,10,36,11],[34,1,34,11],[35,1,35,2],[35,4,35,5],[35,7,35,8],[35,10,35,11],[40,1,40,2],[40,4,40,5],[40,7,40,8],[40,10,40,11],[38,1,38,2],[38,4,38,5],[38,7,38,8],[38,10,38,11],[37,1,37,2],[37,4,37,5],[37,7,37,8],[37,10,37,11],[39,4,39,5],[39,7,39,8],[39,10,39,11],[43,1,43,2],[43,4,43,5],[43,7,43,8],[43,10,43,11],[41,1,41,2],[42,1,42,2],[42,4,42,5],[42,7,42,8],[42,10,42,11],[46,1,46,2],[46,4,46,5],[46,7,46,8],[46,10,46,11],[44,1,44,2],[45,1,45,2],[45,4,45,5],[45,7,45,8],[45,10,45,11],[49,1,49,2],[49,4,49,5],[49,7,49,8],[49,10,49,11],[47,1,47,11],[48,1,48,2],[48,4,48,5],[48,7,48,8],[48,10,48,11],[53,1,53,2],[53,4,53,5],[53,7,53,8],[53,10,53,11],[51,1,51,2],[51,4,51,5],[51,7,51,8],[51,10,51,11],[50,1,50,2],[50,4,50,5],[50,7,50,8],[50,10,50,11],[52,4,52,5],[52,7,52,8],[52,10,52,11],[56,1,56,2],[56,4,56,5],[56,7,56,8],[56,10,56,11],[54,1,54,2],[55,1,55,2],[55,4,55,5],[55,7,55,8],[55,10,55,11],[60,1,60,2],[60,4,60,5],[60,7,60,8],[60,10,60,11],[57,1,57,2],[58,1,58,2],[59,1,59,2],[59,4,59,5],[59,7,59,8],[59,10,59,11],[64,1,64,2],[64,4,64,5],[64,7,64,8],[64,10,64,11],[63,1,63,2],[63,4,63,5],[63,7,63,8],[63,10,63,11],[61,1,61,11],[62,1,62,2],[62,4,62,5],[62,7,62,8],[62,10,62,11],[69,1,69,2],[69,4,69,5],[69,7,69,8],[69,10,69,11],[67,1,67,2],[67,4,67,5],[67,7,67,8],[67,10,67,11],[65,1,65,2],[65,4,65,5],[65,7,65,8],[65,10,65,11],[66,4,66,5],[66,7,66,8],[66,10,66,11],[90,3,95,11],[3,4,3,5],[4,4,4,5],[5,4,5,5],[6,4,6,5],[7,4,7,5],[8,4,8,5],[89,1,89,11],[90,1,95,2],[74,1,74,2],[74,4,74,5],[74,7,74,8],[74,10,74,11],[71,1,71,2],[72,1,72,2],[73,1,73,2],[73,4,73,5],[73,7,73,8],[73,10,73,11],[70,1,70,2],[70,4,70,5],[70,7,70,8],[70,10,70,11],[68,1,68,2],[75,1,75,11],[76,1,76,2],[76,4,76,5],[76,7,76,8],[76,10,76,11],[77,1,77,2],[77,4,77,5],[77,7,77,8],[77,10,77,11],[78,1,78,2],[78,4,78,5],[78,7,78,8],[78,10,78,11],[79,1,79,2],[79,4,79,5],[79,7,79,8],[79,10,79,11],[80,4,80,5],[80,7,80,8],[80,10,80,11],[81,1,81,2],[81,4,81,5],[81,7,81,8],[81,10,81,11],[82,1,82,2],[83,1,83,2],[83,4,83,5],[83,7,83,8],[83,10,83,11],[88,1,88,2],[88,4,88,5],[88,7,88,8],[88,10,88,11],[84,1,84,2],[84,4,84,5],[84,7,84,8],[84,10,84,11],[85,1,85,2],[86,1,86,2],[87,1,87,2],[87,4,87,5],[87,7,87,8],[87,10,87,11]]}
[null,null,null,null,null,null,null,null,null,null,null,null,null,null,null,null,null,null,null,null,null,null,null,null,null,null,"N/A"]
[null,"PNW 3-SECTOR POST CONSTRUCTION FORM",null,null,null,null,null,null,null,null,null,null,null,null,null,null,null,null,null,null,null,null,null,null,null,null,"eNode B"]
[null,null,null,null,null,null,null,null,null,null,null,null,null,null,null,null,null,null,null,null,null,null,null,null,null,null,"RRH - 1 Unit"]
[null,"Site Name:",null,null,"RF ENGINEER:",null,null,null,"INDOOR/OUTDOOR:",null,null,null,null,null,null,null,null,null,null,null,null,null,null,null,null,null,"RRH - 2 Units"]
[null,"Location # / Project:",null,null,"SYSTEM PERFORMANCE ENGINEER:",null,null,null,"700 Equipment:",null,null,null,null,null,null,null,null,null,null,null,null,null,null,null,null,null,"RRH - 3 Units"]
[null,"Date:",null,null,"Type of Structure:",null,null,null,"AWS Equipment:",null,null,null,null,null,null,null,null,null,null,null,null,null,null,null,null,null,"RRH - 4 Units"]
[null,"Address:",null,null,"Structure Ht (ft), include Appurtenance:                                                                    Structure Ht (ft):",null,null,null,"700 ENB Removed:"]
[null,"City/ County:",null,null,"Structure Ht (ft):",null,null,null,"RET Home Cable:",null,null,null,null,null,null,null,null,null,null,null,null,null,null,null,null,null,"RRH - 5 Units"]
{"$rows_left_out":84}
{"sheet":"(3) SECTOR Split or Add","index":3,"n_rows":91,"n_cols":36,"rows_kept":91,"cut":false,"hidden":false,"merged":[[1,1,1,20],[3,2,3,3],[3,6,3,7],[3,8,3,10],[3,14,3,15],[3,16,3,17],[4,6,4,7],[4,8,4,10],[4,14,4,15],[4,16,4,17],[5,2,5,3],[5,6,5,7],[5,8,5,10],[5,14,5,15],[5,16,5,17],[6,2,6,3],[6,6,6,7],[6,8,6,10],[6,14,6,15],[6,16,6,17],[7,6,7,7],[7,8,7,10],[7,14,7,15],[7,16,7,17],[8,2,8,3],[8,6,8,7],[8,8,8,10],[8,14,8,15],[8,16,8,17],[9,2,9,3],[9,6,9,7],[9,8,9,10],[9,14,9,15],[9,16,9,17],[10,2,10,3],[10,6,10,7],[10,8,10,10],[10,14,10,15],[10,16,10,17],[11,6,11,7],[11,8,11,10],[11,14,11,15],[11,16,11,17],[15,7,15,8],[15,10,15,11],[15,13,15,14],[15,16,15,17],[15,19,15,20],[13,1,15,2],[13,3,13,11],[13,12,13,20],[14,3,14,5],[14,6,14,8],[14,9,14,11],[14,12,14,14],[14,15,14,17],[14,18,14,20],[15,4,15,5],[18,1,18,2],[19,1,19,2],[20,1,20,2],[20,4,20,5],[20,7,20,8],[20,10,20,11],[16,16,16,17],[16,19,16,20],[17,1,17,2],[17,4,17,5],[17,7,17,8],[17,10,17,11],[17,13,17,14],[17,16,17,17],[17,19,17,20],[16,1,16,2],[16,4,16,5],[16,7,16,8],[16,10,16,11],[16,13,16,14],[22,19,22,20],[23,1,23,2],[23,4,23,5],[23,7,23,8],[23,10,23,11],[23,13,23,14],[23,16,23,17],[23,19,23,20],[20,13,20,14],[20,16,20,17],[20,19,20,20],[21,1,21,19],[22,1,22,2],[22,4,22,5],[22,7,22,8],[22,10,22,11],[22,13,22,14],[22,16,22,17],[24,19,24,20],[25,1,25,2],[25,4,25,5],[25,7,25,8],[25,10,25,11],[25,13,25,14],[25,16,25,17],[25,19,25,20],[24,1,24,2],[24,4,24,5],[24,7,24,8],[24,10,24,11],[24,13,24,14],[24,16,24,17],[28,1,28,2],[29,1,29,2],[29,4,29,5],[29,7,29,8],[29,10,29,11],[29,13,29,14],[26,19,26,20],[27,1,27,2],[27,4,27,5],[27,7,27,8],[27,10,27,11],[27,13,27,14],[27,16,27,17],[27,19,27,20],[26,1,26,2],[26,4,26,5],[26,7,26,8],[26,10,26,11],[26,13,26,14],[26,16,26,17],[31,1,31,2],[32,1,32,2],[32,4,32,5],[32,7,32,8],[32,10,32,11],[32,13,32,14],[29,16,29,17],[29,19,29,20],[30,1,30,2],[30,4,30,5],[30,7,30,8],[30,10,30,11],[30,13,30,14],[30,16,30,17],[30,19,30,20],[34,1,34,19],[35,1,35,2],[35,4,35,5],[35,7,35,8],[35,10,35,11],[35,13,35,14],[35,16,35,17],[35,19,35,20],[32,16,32,17],[32,19,32,20],[33,1,33,2],[33,4,33,5],[33,7,33,8],[33,10,33,11],[33,13,33,14],[33,16,33,17],[33,19,33,20],[36,19,36,20],[37,1,37,2],[37,4,37,5],[37,7,37,8],[37,10,37,11],[37,13,37,14],[37,16,37,17],[37,19,37,20],[36,1,36,2],[36,4,36,5],[36,7,36,8],[36,10,36,11],[36,13,36,14],[36,16,36,17],[38,19,38,20],[39,1,39,2],[39,4,39,5],[39,7,39,8],[39,10,39,11],[39,13,39,14],[39,16,39,17],[39,19,39,20],[38,1,38,2],[38,4,38,5],[38,7,38,8],[38,10,38,11],[38,13,38,14],[38,16,38,17],[40,19,40,20],[41,1,41,2],[42,1,42,2],[42,4,42,5],[42,7,42,8],[42,10,42,11],[42,13,42,14],[42,16,42,17],[42,19,42,20],[40,1,40,2],[40,4,40,5],[40,7,40,8],[40,10,40,11],[40,13,40,14],[40,16,40,17],[43,19,43,20],[44,1,44,2],[45,1,45,2],[45,4,45,5],[45,7,45,8],[45,10,45,11],[45,13,45,14],[45,16,45,17],[45,19,45,20],[43,1,43,2],[43,4,43,5],[43,7,43,8],[43,10,43,11],[43,13,43,14],[43,16,43,17],[46,19,46,20],[47,1,47,19],[48,1,48,2],[48,4,48,5],[48,7,48,8],[48,10,48,11],[48,13,48,14],[48,16,48,17],[48,19,48,20],[46,1,46,2],[46,4,46,5],[46,7,46,8],[46,10,46,11],[46,13,46,14],[46,16,46,17],[49,19,49,20],[50,1,50,2],[50,4,50,5],[50,7,50,8],[50,10,50,11],[50,13,50,14],[50,16,50,17],[50,19,50,20],[49,1,49,2],[49,4,49,5],[49,7,49,8],[49,10,49,11],[49,13,49,14],[49,16,49,17],[51,19,51,20],[52,1,52,2],[52,4,52,5],[52,7,52,8],[52,10,52,11],[52,13,52,14],[52,16,52,17],[52,19,52,20],[51,1,51,2],[51,4,51,5],[51,7,51,8],[51,10,51,11],[51,13,51,14],[51,16,51,17],[53,19,53,20],[54,1,54,2],[55,1,55,2],[55,4,55,5],[55,7,55,8],[55,10,55,11],[55,13,55,14],[55,16,55,17],[55,19,55,20],[53,1,53,2],[53,4,53,5],[53,7,53,8],[53,10,53,11],[53,13,53,14],[53,16,53,17],[56,19,56,20],[57,1,57,2],[58,1,58,2],[59,1,59,2],[59,4,59,5],[59,7,59,8],[59,10,59,11],[59,13,59,14],[59,16,59,17],[59,19,59,20],[56,1,56,2],[56,4,56,5],[56,7,56,8],[56,10,56,11],[56,13,56,14],[56,16,56,17],[60,19,60,20],[61,1,61,19],[62,1,62,2],[62,4,62,5],[62,7,62,8],[62,10,62,11],[62,13,62,14],[62,16,62,17],[62,19,62,20],[60,1,60,2],[60,4,60,5],[60,7,60,8],[60,10,60,11],[60,13,60,14],[60,16,60,17],[63,19,63,20],[64,1,64,2],[64,4,64,5],[64,7,64,8],[64,10,64,11],[64,13,64,14],[64,16,64,17],[64,19,64,20],[63,1,63,2],[63,4,63,5],[63,7,63,8],[63,10,63,11],[63,13,63,14],[63,16,63,17],[65,19,65,20],[66,1,66,2],[66,4,66,5],[66,7,66,8],[66,10,66,11],[66,13,66,14],[66,16,66,17],[66,19,66,20],[65,1,65,2],[65,4,65,5],[65,7,65,8],[65,10,65,11],[65,13,65,14],[65,16,65,17],[67,19,67,20],[68,1,68,2],[69,1,69,2],[69,4,69,5],[69,7,69,8],[69,10,69,11],[69,13,69,14],[69,16,69,17],[69,19,69,20],[67,1,67,2],[67,4,67,5],[67,7,67,8],[67,10,67,11],[67,13,67,14],[67,16,67,17],[70,19,70,20],[71,1,71,2],[72,1,72,2],[73,1,73,2],[73,4,73,5],[73,7,73,8],[73,10,73,11],[73,13,73,14],[73,16,73,17],[73,19,73,20],[70,1,70,2],[70,4,70,5],[70,7,70,8],[70,10,70,11],[70,13,70,14],[70,16,70,17],[74,19,74,20],[89,1,89,19],[90,1,95,2],[90,3,95,11],[90,12,95,20],[74,1,74,2],[74,4,74,5],[74,7,74,8],[74,10,74,11],[74,13,74,14],[74,16,74,17],[75,1,75,19],[76,1,76,2],[76,4,76,5],[76,7,76,8],[76,10,76,11],[76,13,76,14],[76,16,76,17],[76,19,76,20],[77,1,77,2],[77,4,77,5],[77,7,77,8],[77,10,77,11],[77,13,77,14],[77,16,77,17],[77,19,77,20],[78,1,78,2],[78,4,78,5],[78,7,78,8],[78,10,78,11],[78,13,78,14],[78,16,78,17],[78,19,78,20],[79,1,79,2],[79,4,79,5],[79,7,79,8],[79,10,79,11],[79,13,79,14],[79,16,79,17],[79,19,79,20],[80,1,80,2],[80,4,80,5],[80,7,80,8],[80,10,80,11],[80,13,80,14],[80,16,80,17],[80,19,80,20],[81,1,81,2],[81,4,81,5],[81,7,81,8],[81,10,81,11],[81,13,81,14],[81,16,81,17],[81,19,81,20],[82,1,82,2],[83,1,83,2],[83,4,83,5],[83,7,83,8],[83,10,83,11],[83,13,83,14],[83,16,83,17],[83,19,83,20],[84,1,84,2],[84,4,84,5],[84,7,84,8],[84,10,84,11],[84,13,84,14],[84,16,84,17],[84,19,84,20],[85,1,85,2],[86,1,86,2],[87,1,87,2],[87,4,87,5],[87,7,87,8],[87,10,87,11],[87,13,87,14],[87,16,87,17],[87,19,87,20],[88,1,88,2],[88,4,88,5],[88,7,88,8],[88,10,88,11],[88,13,88,14],[88,16,88,17],[88,19,88,20]]}
[null,null,null,null,null,null,null,null,null,null,null,null,null,null,null,null,null,null,null,null,null,null,null,null,null,null,null,null,null,null,null,null,null,null,null,"N/A"]
[null,"PNW 3-SECTOR plus Sector Split/Add POST CONSTRUCTION FORM",null,null,null,null,null,null,null,null,null,null,null,null,null,null,null,null,null,null,null,null,null,null,null,null,null,null,null,null,null,null,null,null,null,"eNode B"]
[null,null,null,null,null,null,null,null,null,null,null,null,null,null,null,null,null,null,null,null,null,null,null,null,null,null,null,null,null,null,null,null,null,null,null,"RRH - 1 Unit"]
[null,"Site Name:",null,null,null,null,"RF ENGINEER:",null,null,null,null,null,null,null,"INDOOR/OUTDOOR:",null,null,null,null,null,null,null,null,null,null,null,null,null,null,null,null,null,null,null,null,"RRH - 2 Units"]
[null,"Location # / Project:",null,"LTE/AWS",null,null,"SYSTEM PERFORMANCE ENGINEER:",null,null,null,null,null,null,null,"700 Equipment:",null,null,null,null,null,null,null,null,null,null,null,null,null,null,null,null,null,null,null,null,"RRH - 3 Units"]
[null,"Date:",null,null,null,null,"Type of Structure:",null,null,null,null,null,null,null,"700 Equipment (B2B):",null,null,null,null,null,null,null,null,null,null,null,null,null,null,null,null,null,null,null,null,"RRH - 4 Units"]
[null,"Address:",null,null,null,null,"Structure Ht (ft), include Appurtenance:                                                                    Structure Ht (ft):",null,null,null,null,null,null,null,"700 ENB Removed:"]
[null,"City/ County:","City","County",null,null,"Structure Ht (ft):",null,null,null,null,null,null,null,"AWS Equipment:",null,null,null,null,null,null,null,null,null,null,null,null,null,null,null,null,null,null,null,null,"RRH - 5 Units"]
{"$rows_left_out":84}
{"sheet":"Sweep-PIM","index":4,"n_rows":91,"n_cols":13,"rows_kept":91,"cut":false,"hidden":false,"merged":[[65,0,67,3],[65,4,67,12],[90,4,92,12],[90,0,92,3]]}
["Sector ","Frequency","Color Code","Ant RL-Mandantory for all NEW Antennas","PIM Ant-Mandatory for all NEW Antennas","PIM Coax-Mandatory for all NEW Coax Systems","PIM Sys-Mandatory for all NEW Coax/Ant Systems","IL-Mandatory for all NEW Coax Systems","RL Load-Mandatory for all NEW Coax Systems","RL Sys-Mandatory for all NEW Coax/Ant Systems","DTF Load-Mandatory for all NEW Coax Systems","DTF Short-Mandatory for all NEW Coax Systems","DTF Sys-Mandatory for all NEW Coax/Ant Systems"]
[]
["Alpha",850,"WY"]
["Alpha",850,"WYY"]
[]
["Beta",850,"BY"]
["Beta",850,"BYY"]
[]
{"$rows_left_out":84}
{"sheet":"RET Screen Shot","index":5,"n_rows":1,"n_cols":2,"rows_kept":1,"cut":false,"hidden":false,"merged":[]}
[null,"*Example Shown Below"]

{"sheet":"Fiber OTDR Results","index":6,"n_rows":36,"n_cols":14,"rows_kept":36,"cut":false,"hidden":false,"merged":[[35,0,37,1],[35,2,37,5],[35,8,37,9],[35,10,37,13]]}
[]
[null,"Test Date","Overall Length","Reflection","Loss","Pass/Fail",null,null,null,"Test Date","Overall Length","Reflection","Loss","Pass/Fail"]
["AWS",null,null,null,null,null,null,null,"AWS B2B"]
["Alpha A 1310nm",null,null,null,null,null,null,null,"Alpha (2) A 1310nm"]
["Alpha A 1550nm",null,null,null,null,null,null,null,"Alpha (2) A 1550nm"]
["Alpha B 1310nm",null,null,null,null,null,null,null,"Alpha (2) B 1310nm"]
["Alpha B 1550nm",null,null,null,null,null,null,null,"Alpha (2) B 1550nm"]
[]
{"$rows_left_out":29}
{"sheet":"Feeder Misc","index":7,"n_rows":35,"n_cols":16,"rows_kept":35,"cut":false,"hidden":true,"merged":[[0,0,0,15],[1,3,1,4],[1,5,1,6],[1,7,1,8],[1,9,1,10],[1,11,1,12],[1,13,1,15]]}
["Transmission Line Specifications"]
[null,null,null,"700 Band",null,"850 Band",null,"1700 Band",null,"1900 Band",null,"2100 Band",null,"Delay"]
["Manufacture","Feeder","Diameter","Loss (dB/ft)","Loss (dB/m)","Loss (dB/ft)","Loss (dB/m)","Loss (dB/ft)","Loss (dB/m)","Loss (dB/ft)","Loss (dB/m)","Loss (dB/ft)","Loss (dB/m)","Rel.Velocity","delay m/ns","delay ft/ns"]
["ANDREW","LDF 4-50A","1/2\"",1.83E-2,6.0100000000000001E-2,2.0334285714285714E-2,6.6677142857142851E-2,null,null,3.1600000000000003E-2,0.10399999999999998,3.3399999999999999E-2,0.11,0.88,0.26400000000000001,0.86614173360000013]
["ANDREW","LDF 5-50A","7/8\"",1.03E-2,3.3700000000000001E-2,1.1485714285714287E-2,3.7568571428571423E-2,null,null,1.805E-2,5.9299999999999999E-2,1.9199999999999998E-2,6.2899999999999998E-2,0.89,0.26700000000000002,0.87598425330000007]
["ANDREW","LDF 6-50A","1 1/4\"",7.3200000000000001E-3,2.4E-2,8.171142857142856E-3,2.678285714285714E-2,null,null,1.3100000000000001E-2,4.2950000000000002E-2,1.3899999999999999E-2,4.5599999999999995E-2,0.89,0.26700000000000002,0.87598425330000007]
["ANDREW","LDF 7-50A","1 5/8\"",6.0200000000000002E-3,1.9740000000000001E-2,6.7388571428571428E-3,2.210742857142857E-2,null,null,1.095E-2,3.5915000000000002E-2,1.1650000000000001E-2,3.8239999999999996E-2,0.88,0.26400000000000001,0.86614173360000013]
["ANDREW","LDF 12-50","2 1/4\"",5.1900000000000002E-3,1.703E-2,5.827714285714285E-3,1.9132857142857142E-2,null,null,9.6150000000000003E-3,3.1555E-2,1.026E-2,3.3660000000000002E-2,0.88,0.26400000000000001,0.86614173360000013]
{"$rows_left_out":28}
{"sheet":"TMA-DIPLEXER","index":8,"n_rows":19,"n_cols":17,"rows_kept":19,"cut":false,"hidden":true,"merged":[]}
["Type","Model","Diameter","Loss (dB/ft)","Loss (dB/m)","Loss (dB/ft)","Loss (dB/m)","Loss (dB/ft)","Loss (dB/m)","Loss (dB/ft)","Loss (dB/m)","Loss (dB/ft)","Loss (dB/m)","Rel.Velocity","delay m/ns","DL delay ft/ns","UL delay ft/ns"]
["TMA","COMMSCOPE",null,null,null,null,null,null,null,null,null,null,null,null,null,60,180]
["TMA","WESTELL",null,null,null,null,null,null,null,null,null,null,null,null,null,60,180]
["TMA","ANDREW-BYPASS",null,null,null,null,null,null,null,null,null,null,null,null,null,5]
["TMA","WESTELL-BYPASS",null,null,null,null,null,null,null,null,null,null,null,null,null,5]
["TMA","NA",null,null,null,null,null,null,null,null,null,null,null,null,null,0]
[]
[]
{"$rows_left_out":12}
{"sheet":"Sheet1","index":9,"n_rows":46,"n_cols":2,"rows_kept":46,"cut":false,"hidden":true,"merged":[]}
["LTE ENB"]
["RRUL-- 1 Unit/6601"]
["RRUL-- 2 Units/6601"]
["RRUL-- 3 Units/ 6601"]
[]
["N/A"]
["LTE SHELF ADD"]
["RRUL-- 1 Unit/ ENB"]
{"$rows_left_out":38}