Bug 83841 - PackageKit-Qt-0.9.2 fails to build at 'class DaemonProxy'
Summary: PackageKit-Qt-0.9.2 fails to build at 'class DaemonProxy'
Status: RESOLVED NOTABUG
Alias: None
Product: PackageKit
Classification: Unclassified
Component: packagekit-qt (show other bugs)
Version: unspecified
Hardware: All Linux (All)
: medium blocker
Assignee: Richard Hughes
QA Contact:
URL:
Whiteboard:
Keywords:
Depends on:
Blocks:
 
Reported: 2014-09-14 10:08 UTC by Matthias Mailänder
Modified: 2018-08-21 15:52 UTC (History)
0 users

See Also:
i915 platform:
i915 features:


Attachments

Note You need to log in before you can comment on or make changes to this bug.
Description Matthias Mailänder 2014-09-14 10:08:54 UTC
In file included from /home/abuild/rpmbuild/BUILD/PackageKit-Qt-0.9.2/src/daemon.cpp:28:0:
/home/abuild/rpmbuild/BUILD/PackageKit-Qt-0.9.2/build/src/daemonproxy.h:160:7: error: redefinition of 'class DaemonProxy'
 class DaemonProxy: public QDBusAbstractInterface
       ^
In file included from /home/abuild/rpmbuild/BUILD/PackageKit-Qt-0.9.2/src/daemon.cpp:28:0:
/home/abuild/rpmbuild/BUILD/PackageKit-Qt-0.9.2/build/src/daemonproxy.h:26:7: error: previous definition of 'class DaemonProxy'
 class DaemonProxy: public QDBusAbstractInterface
       ^
In file included from /home/abuild/rpmbuild/BUILD/PackageKit-Qt-0.9.2/src/daemon.cpp:28:0:
/home/abuild/rpmbuild/BUILD/PackageKit-Qt-0.9.2/build/src/daemonproxy.h:206:26: error: 'namespace org::freedesktop::PackageKit { }' redeclared as different kind of symbol
     namespace PackageKit {
                          ^
/home/abuild/rpmbuild/BUILD/PackageKit-Qt-0.9.2/build/src/daemonproxy.h:205:27: error: previous declaration of 'typedef class DaemonProxy org::freedesktop::PackageKit'
     typedef ::DaemonProxy PackageKit;
                           ^
src/CMakeFiles/packagekitqt4.dir/build.make:112: recipe for target 'src/CMakeFiles/packagekitqt4.dir/daemon.cpp.o' failed
make[2]: *** [src/CMakeFiles/packagekitqt4.dir/daemon.cpp.o] Error 1
CMakeFiles/Makefile2:77: recipe for target 'src/CMakeFiles/packagekitqt4.dir/all' failed
make[1]: *** [src/CMakeFiles/packagekitqt4.dir/all] Error 2
Makefile:117: recipe for target 'all' failed
make: *** [all] Error 2


See https://build.opensuse.org/package/show/GNOME:Next/PackageKit-Qt
Comment 1 Richard Hughes 2018-08-21 15:52:30 UTC
We moved the upstream bugtracker to GitHub a long time ago. If this issue still affects you please re-create the issue here: https://github.com/hughsie/PackageKit/issues
 
Sorry for the impersonal message, and fingers crossed your issue no longer happens. Thanks.


Use of freedesktop.org services, including Bugzilla, is subject to our Code of Conduct. How we collect and use information is described in our Privacy Policy.