Bug 13342

Summary: 1 of 4 tests failed, so reporting per the instructions...
Product: cairo Reporter: tony z <ewsinc>
Component: generalAssignee: Carl Worth <cworth>
Status: RESOLVED FIXED QA Contact: cairo-bugs mailing list <cairo-bugs>
Severity: normal    
Priority: medium CC: chris
Version: 1.4.10   
Hardware: Other   
OS: All   
i915 platform: i915 features:

Description tony z 2007-11-21 23:51:41 UTC
this is the tail of the 'make check' ... fwiw, hope it helps. Hope I have a good build of cairo :) Let me know if you need any more info and I'll try to answer.


make  check-TESTS
make[2]: Entering directory `/tmp/cairo-1.4.10/src'
make[3]: Entering directory `/tmp/cairo-1.4.10/src'
make[3]: `cairo.def' is up to date.
make[3]: Leaving directory `/tmp/cairo-1.4.10/src'
Checking cairo.def
< cairo_glitz_surface_create
FAIL: check-def.sh
Checking .libs/libcairo.so for local PLT entries
PASS: check-plt.sh
Checking public headers for missing cairo_public decorators
PASS: check-headers.sh
Checking source files for missing or misplaced #include "cairoint.h"
PASS: check-cairoint.sh
1 of 4 tests failed
Please report to http://bugs.freedesktop.org/enter_bug.cgi?product=cairo
make[2]: *** [check-TESTS] Error 1
make[2]: Leaving directory `/tmp/cairo-1.4.10/src'
make[1]: *** [check-am] Error 2
make[1]: Leaving directory `/tmp/cairo-1.4.10/src'
make: *** [check-recursive] Error 1
Comment 1 Chris Wilson 2008-01-11 07:48:10 UTC
Thanks, fixed with commit be146f0.

Use of freedesktop.org services, including Bugzilla, is subject to our Code of Conduct. How we collect and use information is described in our Privacy Policy.