Bug 100939 - Can't build with LLVM/clang
Summary: Can't build with LLVM/clang
Status: RESOLVED MOVED
Alias: None
Product: Wayland
Classification: Unclassified
Component: wayland (show other bugs)
Version: unspecified
Hardware: x86-64 (AMD64) Linux (All)
: medium major
Assignee: Wayland bug list
QA Contact:
URL:
Whiteboard:
Keywords:
Depends on:
Blocks:
 
Reported: 2017-05-05 06:27 UTC by Tomasz Paweł Gajc
Modified: 2018-06-08 23:49 UTC (History)
0 users

See Also:
i915 platform:
i915 features:


Attachments

Note You need to log in before you can comment on or make changes to this bug.
Description Tomasz Paweł Gajc 2017-05-05 06:27:20 UTC
Wayland 1.13.0 build fails with LLVM/clang 4.1 with LTO enabled

More logs can be found here http://file-store.openmandriva.org/api/v1/file_stores/5af6909e374c756e8e67307535a3f9530d6f7861.log?show=true


make[2]: Entering directory '/builddir/build/BUILD/wayland-1.13.0'
/bin/sh ./libtool  --tag=CC   --mode=link /usr/bin/clang -Wall -Wextra -Wno-unused-parameter -g -Wstrict-prototypes -Wmissing-prototypes -fvisibility=hidden -Os -gdwarf-4 -Wstrict-aliasing=2 -pipe -Wformat -Werror=format-security -D_FORTIFY_SOURCE=2 -fstack-protector --param=ssp-buffer-size=4  -fPIC -flto  -Os -gdwarf-4 -Wstrict-aliasing=2 -pipe -Wformat -Werror=format-security -D_FORTIFY_SOURCE=2 -fstack-protector --param=ssp-buffer-size=4  -fPIC -flto -Wl,-O2  -Wl,--no-undefined -flto  -o fixed-test tests/fixed-test.o libtest-runner.la 
libtool: link: /usr/bin/clang -Wall -Wextra -Wno-unused-parameter -g -Wstrict-prototypes -Wmissing-prototypes -fvisibility=hidden -Os -gdwarf-4 -Wstrict-aliasing=2 -pipe -Wformat -Werror=format-security -D_FORTIFY_SOURCE=2 -fstack-protector --param=ssp-buffer-size=4 -fPIC -flto -Os -gdwarf-4 -Wstrict-aliasing=2 -pipe -Wformat -Werror=format-security -D_FORTIFY_SOURCE=2 -fstack-protector --param=ssp-buffer-size=4 -fPIC -flto -Wl,-O2 -Wl,--no-undefined -flto -o .libs/fixed-test tests/fixed-test.o  ./.libs/libtest-runner.a /builddir/build/BUILD/wayland-1.13.0/.libs/libwayland-client.so /builddir/build/BUILD/wayland-1.13.0/.libs/libwayland-server.so -lm -lrt -ldl -lffi -pthread
make[2]: Leaving directory '/builddir/build/BUILD/wayland-1.13.0'
/tmp/lto-llvm-ceeca4.o:ld-temp.o:function main: error: undefined reference to '__stop_test_section'
/tmp/lto-llvm-ceeca4.o:ld-temp.o:function main: error: undefined reference to '__start_test_section'
/tmp/lto-llvm-ceeca4.o:ld-temp.o:function main: error: undefined reference to '__start_test_section'
/tmp/lto-llvm-ceeca4.o:ld-temp.o:function main: error: undefined reference to '__stop_test_section'
/tmp/lto-llvm-ceeca4.o:ld-temp.o:function main: error: undefined reference to '__stop_test_section'
/tmp/lto-llvm-ceeca4.o:ld-temp.o:function main: error: undefined reference to '__start_test_section'
/tmp/lto-llvm-ceeca4.o:ld-temp.o:function main: error: undefined reference to '__start_test_section'
/tmp/lto-llvm-ceeca4.o:ld-temp.o:function main: error: undefined reference to '__stop_test_section'
clang-4.0: error: linker command failed with exit code 1 (use -v to see invocation)
make[2]: *** [Makefile:1446: fixed-test] Error 1
make[2]: *** Waiting for unfinished jobs....
Comment 1 GitLab Migration User 2018-06-08 23:49:32 UTC
-- GitLab Migration Automatic Message --

This bug has been migrated to freedesktop.org's GitLab instance and has been closed from further activity.

You can subscribe and participate further through the new bug through this link to our GitLab instance: https://gitlab.freedesktop.org/wayland/wayland/issues/31.


Use of freedesktop.org services, including Bugzilla, is subject to our Code of Conduct. How we collect and use information is described in our Privacy Policy.