Bug 108987 - [CI][DRMTIP]igt@perf@short-reads - incomplete
Summary: [CI][DRMTIP]igt@perf@short-reads - incomplete
Status: RESOLVED WORKSFORME
Alias: None
Product: DRI
Classification: Unclassified
Component: IGT (show other bugs)
Version: XOrg git
Hardware: Other All
: medium normal
Assignee: Default DRI bug account
QA Contact:
URL:
Whiteboard:
Keywords:
Depends on:
Blocks:
 
Reported: 2018-12-09 14:06 UTC by Lakshmi
Modified: 2019-06-14 12:05 UTC (History)
0 users

See Also:
i915 platform:
i915 features:


Attachments

Note You need to log in before you can comment on or make changes to this bug.
Description Lakshmi 2018-12-09 14:06:11 UTC
https://intel-gfx-ci.01.org/tree/drm-tip/drmtip_150/fi-hsw-4770/igt@perf@short-reads.htmlErr	
Err:
Starting subtest: short-reads
Subtest short-reads: SUCCESS (0.040s)
Dmesg:	
<6> [226.130737] Console: switching to colour dummy device 80x25
<6> [226.130782] [IGT] perf: executing
<6> [226.134982] [IGT] perf: starting subtest short-reads
<7> [226.144119] [drm:i915_perf_open_ioctl [i915]] OA Buffer initialized, gtt offset = 0x1000000, vaddr = 0000000095bba7dc
<5> [226.175031] [drm] Skipping spurious, invalid OA report
<5> [226.175034] [drm] Skipping spurious, invalid OA report
<5> [226.175035] [drm] Skipping spurious, invalid OA report
<5> [226.175036] [drm] Skipping spurious, invalid OA report
<5> [226.175037] [drm] Skipping spurious, invalid OA report
<5> [226.175039] [drm] Skipping spurious, invalid OA report
<5> [226.175040] [drm] Skipping spurious, invalid OA report
<5> [226.175041] [drm] Skipping spurious, invalid OA report
<5> [226.175042] [drm] Skipping spurious, invalid OA report
<5> [226.175043] [drm] Skipping spurious, invalid OA report
<5> [226.175324] [drm] 54 spurious OA report notices suppressed due to ratelimiting
<6> [226.175547] [IGT] perf: exiting, ret=0
<6> [226.219085] Console: switching to colour frame buffer device 128x48

https://intel-gfx-ci.01.org/tree/drm-tip/drmtip_150/fi-hsw-4770/run16.log

Started CI_IGT_test #2617848
Started from command line by qa-reports
[EnvInject] - Loading node environment variables.
Building remotely on fi-hsw-4770 (CIIGT PATCHWORK TRYBOT WATCHDOG CIDRM) in workspace /opt/jenkins/workspace/CI_IGT_test
Set build name.
New build name is 'drmtip_150/fi-hsw-4770/16'
[CI_IGT_test] $ /bin/bash -xe /tmp/jenkins2842699993013698976.sh
+ set +x
hsw-4770 4.20.0-rc4-ge556a1602bef-drmtip_150+
logdir drmtip_150/fi-hsw-4770
/opt/scripts/dut/deploy_igt.sh: drmtip_150
IGT_4730
Testlist: shards/x0016
Timestamp 1543386592
Initializing watchdogs
 /dev/watchdog0
[01/79] (1080s left) gem_ctx_isolation (vcs0-dirty-switch)
Subtest vcs0-dirty-switch: SKIP
[02/79] (1080s left) gem_exec_parse (cmd-crossing-page)
Starting subtest: cmd-crossing-page
Subtest cmd-crossing-page: SUCCESS (0.001s)
[03/79] (1080s left) kms_frontbuffer_tracking (psr-2p-scndscrn-cur-indfb-move)
Starting subtest: psr-2p-scndscrn-cur-indfb-move
Subtest psr-2p-scndscrn-cur-indfb-move: SKIP (0.000s)
[04/79] (1080s left) kms_chamelium (dp-crc-single)
Subtest dp-crc-single: SKIP
[05/79] (1080s left) syncobj_wait (wait-any-interrupted)
Starting subtest: wait-any-interrupted
Subtest wait-any-interrupted: SUCCESS (0.104s)
[06/79] (1080s left) prime_busy (wait-hang-blt)
Starting subtest: wait-hang-blt
Subtest wait-hang-blt: SUCCESS (13.633s)
[07/79] (1066s left) kms_frontbuffer_tracking (fbc-1p-primscrn-cur-indfb-draw-mmap-gtt)
Starting subtest: fbc-1p-primscrn-cur-indfb-draw-mmap-gtt
Subtest fbc-1p-primscrn-cur-indfb-draw-mmap-gtt: SUCCESS (1.351s)
[08/79] (1064s left) kms_universal_plane (cursor-fb-leak-pipe-e)
Subtest cursor-fb-leak-pipe-E: SKIP
[09/79] (1064s left) gem_caching (writes)
Starting subtest: writes
Subtest writes: SUCCESS (1.942s)
[10/79] (1062s left) kms_frontbuffer_tracking (fbc-2p-primscrn-pri-shrfb-draw-mmap-gtt)
Starting subtest: fbc-2p-primscrn-pri-shrfb-draw-mmap-gtt
Subtest fbc-2p-primscrn-pri-shrfb-draw-mmap-gtt: SKIP (0.000s)
[11/79] (1062s left) gem_bad_reloc (negative-reloc-lut-bsd)
Starting subtest: negative-reloc-lut-bsd
Subtest negative-reloc-lut-bsd: SUCCESS (0.000s)
[12/79] (1062s left) kms_chamelium (hdmi-crc-xrgb8888)
Subtest hdmi-crc-xrgb8888: SKIP
[13/79] (1062s left) gem_set_tiling_vs_blt (tiled-to-untiled)
Starting subtest: tiled-to-untiled
Subtest tiled-to-untiled: SUCCESS (0.317s)
[14/79] (1062s left) gem_ctx_isolation (bcs0-dirty-switch)
Subtest bcs0-dirty-switch: SKIP
[15/79] (1061s left) kms_flip (single-buffer-flip-vs-dpms-off-vs-modeset-interruptible)
Starting subtest: single-buffer-flip-vs-dpms-off-vs-modeset-interruptible
Subtest single-buffer-flip-vs-dpms-off-vs-modeset-interruptible: SUCCESS (2.058s)
[16/79] (1059s left) kms_psr (cursor_mmap_cpu)
Subtest cursor_mmap_cpu: SKIP
[17/79] (1059s left) perf_pmu (other-init-3)
Starting subtest: other-init-3
Subtest other-init-3: SUCCESS (0.000s)
[18/79] (1059s left) gem_wait (await-default)
Starting subtest: await-default
Subtest await-default: SUCCESS (1.016s)
[19/79] (1058s left) prime_vgem (wait-bsd2)
Starting subtest: wait-bsd2
Subtest wait-bsd2: SKIP (0.000s)
[20/79] (1058s left) gem_exec_schedule (wide-bsd1)
Subtest wide-bsd1: SKIP
[21/79] (1058s left) kms_plane_scaling (pipe-b-plane-scaling)
Subtest pipe-B-plane-scaling: SKIP
[22/79] (1058s left) prime_nv_api (i915_nv_import_vs_close)
Subtest i915_nv_import_vs_close: SKIP
[23/79] (1058s left) kms_flip_tiling (flip-to-y-tiled)
Starting subtest: flip-to-Y-tiled
Subtest flip-to-Y-tiled: SKIP (0.000s)
[24/79] (1058s left) kms_busy (extended-pageflip-hang-oldfb-render-c)
Starting subtest: extended-pageflip-hang-oldfb-render-C
Subtest extended-pageflip-hang-oldfb-render-C: SUCCESS (0.169s)
[25/79] (1057s left) kms_flip (2x-flip-vs-blocking-wf-vblank)
Starting subtest: 2x-flip-vs-blocking-wf-vblank
Subtest 2x-flip-vs-blocking-wf-vblank: SKIP (0.002s)
[26/79] (1057s left) gem_ctx_isolation (vecs0-clean)
Subtest vecs0-clean: SKIP
[27/79] (1057s left) kms_atomic_transition (3x-modeset-transitions-nonblocking-fencing)
Starting subtest: 3x-modeset-transitions-nonblocking-fencing
Subtest 3x-modeset-transitions-nonblocking-fencing: SKIP (0.000s)
[28/79] (1057s left) perf_pmu (most-busy-idle-check-all-vcs0)
Starting subtest: most-busy-idle-check-all-vcs0
Subtest most-busy-idle-check-all-vcs0: SUCCESS (0.612s)
[29/79] (1057s left) kms_frontbuffer_tracking (fbcpsr-2p-scndscrn-cur-indfb-draw-mmap-wc)
Starting subtest: fbcpsr-2p-scndscrn-cur-indfb-draw-mmap-wc
Subtest fbcpsr-2p-scndscrn-cur-indfb-draw-mmap-wc: SKIP (0.000s)
[30/79] (1056s left) kms_frontbuffer_tracking (fbc-2p-scndscrn-pri-shrfb-draw-mmap-wc)
Starting subtest: fbc-2p-scndscrn-pri-shrfb-draw-mmap-wc
Subtest fbc-2p-scndscrn-pri-shrfb-draw-mmap-wc: SKIP (0.000s)
[31/79] (1056s left) syncobj_wait (invalid-wait-bad-flags)
Starting subtest: invalid-wait-bad-flags
Subtest invalid-wait-bad-flags: SUCCESS (0.000s)
[32/79] (1056s left) kms_addfb_basic (bad-pitch-63)
Starting subtest: bad-pitch-63
Subtest bad-pitch-63: SUCCESS (0.000s)
[33/79] (1056s left) kms_frontbuffer_tracking (fbc-1p-primscrn-spr-indfb-onoff)
Starting subtest: fbc-1p-primscrn-spr-indfb-onoff
Subtest fbc-1p-primscrn-spr-indfb-onoff: SUCCESS (1.781s)
[34/79] (1054s left) kms_frontbuffer_tracking (fbcpsr-2p-primscrn-pri-shrfb-draw-blt)
Starting subtest: fbcpsr-2p-primscrn-pri-shrfb-draw-blt
Subtest fbcpsr-2p-primscrn-pri-shrfb-draw-blt: SKIP (0.000s)
[35/79] (1054s left) kms_frontbuffer_tracking (psr-1p-primscrn-cur-indfb-move)
Starting subtest: psr-1p-primscrn-cur-indfb-move
Subtest psr-1p-primscrn-cur-indfb-move: SKIP (0.000s)
[36/79] (1054s left) kms_flip (wf_vblank-ts-check-interruptible)
Starting subtest: wf_vblank-ts-check-interruptible
Subtest wf_vblank-ts-check-interruptible: SUCCESS (31.728s)
[37/79] (1022s left) kms_vblank (pipe-b-query-forked-busy)
Starting subtest: pipe-B-query-forked-busy
Subtest pipe-B-query-forked-busy: SUCCESS (2.332s)
[38/79] (1020s left) kms_cursor_legacy (cursor-vs-flip-atomic-transitions)
Starting subtest: cursor-vs-flip-atomic-transitions
Subtest cursor-vs-flip-atomic-transitions: SUCCESS (27.591s)
[39/79] ( 992s left) perf_pmu (busy-idle-check-all-rcs0)
Starting subtest: busy-idle-check-all-rcs0
Subtest busy-idle-check-all-rcs0: SUCCESS (0.617s)
[40/79] ( 991s left) drm_import_export (prime)
Starting subtest: prime
Subtest prime: SUCCESS (22.326s)
[41/79] ( 969s left) gem_wait (write-wait-blt)
Starting subtest: write-wait-blt
Subtest write-wait-blt: SUCCESS (1.009s)
[42/79] ( 968s left) gem_mmap (big-bo)
Starting subtest: big-bo
Subtest big-bo: SUCCESS (0.620s)
[43/79] ( 967s left) kms_pwrite_crc
[44/79] ( 967s left) kms_frontbuffer_tracking (fbcpsr-1p-primscrn-cur-indfb-draw-pwrite)
Starting subtest: fbcpsr-1p-primscrn-cur-indfb-draw-pwrite
Subtest fbcpsr-1p-primscrn-cur-indfb-draw-pwrite: SKIP (0.000s)
[45/79] ( 967s left) kms_cursor_crc (cursor-128x42-offscreen)
Starting subtest: cursor-128x42-offscreen
Subtest cursor-128x42-offscreen: SUCCESS (23.861s)
[46/79] ( 943s left) kms_cursor_crc (cursor-128x128-random)
Starting subtest: cursor-128x128-random
Subtest cursor-128x128-random: SUCCESS (21.309s)
[47/79] ( 921s left) i915_hangman (error-state-capture-vebox)
Starting subtest: error-state-capture-vebox
Subtest error-state-capture-vebox: SUCCESS (12.015s)
[48/79] ( 909s left) gem_exec_schedule (preempt-contexts-blt)
Subtest preempt-contexts-blt: SKIP
[49/79] ( 909s left) kms_draw_crc (draw-method-xrgb8888-mmap-cpu-untiled)
Starting subtest: draw-method-xrgb8888-mmap-cpu-untiled
Subtest draw-method-xrgb8888-mmap-cpu-untiled: SUCCESS (0.209s)
[50/79] ( 909s left) kms_frontbuffer_tracking (fbc-1p-offscren-pri-shrfb-draw-blt)
Starting subtest: fbc-1p-offscren-pri-shrfb-draw-blt
Subtest fbc-1p-offscren-pri-shrfb-draw-blt: SUCCESS (0.963s)
[51/79] ( 908s left) gem_pwrite (huge-gtt-backwards)
Starting subtest: huge-gtt-backwards
Subtest huge-gtt-backwards: SUCCESS (3.645s)
[52/79] ( 904s left) gem_pwrite (small-gtt-forwards)
Starting subtest: small-gtt-forwards
Subtest small-gtt-forwards: SUCCESS (0.508s)
[53/79] ( 903s left) gem_exec_schedule (deep-vebox)
Subtest deep-vebox: SKIP
[54/79] ( 903s left) kms_busy (extended-modeset-hang-newfb-with-reset-render-a)
Starting subtest: extended-modeset-hang-newfb-with-reset-render-A
Subtest extended-modeset-hang-newfb-with-reset-render-A: SUCCESS (25.275s)
[55/79] ( 877s left) syncobj_basic (create-signaled)
Starting subtest: create-signaled
Subtest create-signaled: SUCCESS (0.000s)
[56/79] ( 877s left) gem_exec_faulting_reloc (normal)
Starting subtest: normal
Subtest normal: SUCCESS (0.001s)
[57/79] ( 877s left) gem_persistent_relocs (normal)
Starting subtest: normal
Subtest normal: SUCCESS (0.731s)
[58/79] ( 877s left) kms_flip (2x-absolute-wf_vblank)
Starting subtest: 2x-absolute-wf_vblank
Subtest 2x-absolute-wf_vblank: SKIP (0.001s)
[59/79] ( 876s left) kms_cursor_legacy (cursora-vs-flipb-toggle)
Starting subtest: cursorA-vs-flipB-toggle
Subtest cursorA-vs-flipB-toggle: SKIP (0.000s)
[60/79] ( 876s left) kms_busy (basic-flip-e)
Subtest basic-flip-E: SKIP
[61/79] ( 876s left) gem_exec_reloc (basic-gtt-read-active)
Starting subtest: basic-gtt-read-active
Subtest basic-gtt-read-active: SUCCESS (0.112s)
[62/79] ( 876s left) perf (oa-formats)
Starting subtest: oa-formats
Subtest oa-formats: SUCCESS (0.537s)
[63/79] ( 875s left) perf (short-reads)
/tmp/jenkins2842699993013698976.sh: line 104:  1068 Segmentation fault      sudo LD_LIBRARY_PATH=/opt/igt/lib:/opt/igt/lib/x86_64-linux-gnu IGT_CI_META_TEST=yes IGT_REBOOT_ON_FATAL_ERROR=yes "${IGT_PATH}/bin/igt_runner" -o -l verbose -s $TESTS -n "${JENKINS_NODE}@${ARCHIVE_NAME}@${RUN}" --abort-on-monitored-error=taint --overall-timeout $OVERALL --inactivity-timeout $OWATCH --use-watchdog --piglit-style-dmesg "${IGT_TEST_ROOT}" "${LOGDIR}/${RUN}"
FATAL: command execution failed
java.io.EOFException
	at java.io.ObjectInputStream$PeekInputStream.readFully(ObjectInputStream.java:2681)
	at java.io.ObjectInputStream$BlockDataInputStream.readShort(ObjectInputStream.java:3156)
	at java.io.ObjectInputStream.readStreamHeader(ObjectInputStream.java:862)
	at java.io.ObjectInputStream.<init>(ObjectInputStream.java:358)
	at hudson.remoting.ObjectInputStreamEx.<init>(ObjectInputStreamEx.java:49)
	at hudson.remoting.Command.readFrom(Command.java:140)
	at hudson.remoting.Command.readFrom(Command.java:126)
	at hudson.remoting.AbstractSynchronousByteArrayCommandTransport.read(AbstractSynchronousByteArrayCommandTransport.java:36)
	at hudson.remoting.SynchronousCommandTransport$ReaderThread.run(SynchronousCommandTransport.java:63)
Caused: java.io.IOException: Unexpected termination of the channel
	at hudson.remoting.SynchronousCommandTransport$ReaderThread.run(SynchronousCommandTransport.java:77)
Caused: java.io.IOException: Backing channel 'fi-hsw-4770' is disconnected.
	at hudson.remoting.RemoteInvocationHandler.channelOrFail(RemoteInvocationHandler.java:214)
	at hudson.remoting.RemoteInvocationHandler.invoke(RemoteInvocationHandler.java:283)
	at com.sun.proxy.$Proxy64.isAlive(Unknown Source)
	at hudson.Launcher$RemoteLauncher$ProcImpl.isAlive(Launcher.java:1144)
	at hudson.Launcher$RemoteLauncher$ProcImpl.join(Launcher.java:1136)
	at hudson.tasks.CommandInterpreter.join(CommandInterpreter.java:155)
	at hudson.tasks.CommandInterpreter.perform(CommandInterpreter.java:109)
	at hudson.tasks.CommandInterpreter.perform(CommandInterpreter.java:66)
	at hudson.tasks.BuildStepMonitor$1.perform(BuildStepMonitor.java:20)
	at hudson.model.AbstractBuild$AbstractBuildExecution.perform(AbstractBuild.java:744)
	at hudson.model.Build$BuildExecution.build(Build.java:206)
	at hudson.model.Build$BuildExecution.doRun(Build.java:163)
	at hudson.model.AbstractBuild$AbstractBuildExecution.run(AbstractBuild.java:504)
	at hudson.model.Run.execute(Run.java:1810)
	at hudson.model.FreeStyleBuild.run(FreeStyleBuild.java:43)
	at hudson.model.ResourceController.execute(ResourceController.java:97)
	at hudson.model.Executor.run(Executor.java:429)
FATAL: Unable to delete script file /tmp/jenkins2842699993013698976.sh
java.io.EOFException
	at java.io.ObjectInputStream$PeekInputStream.readFully(ObjectInputStream.java:2681)
	at java.io.ObjectInputStream$BlockDataInputStream.readShort(ObjectInputStream.java:3156)
	at java.io.ObjectInputStream.readStreamHeader(ObjectInputStream.java:862)
	at java.io.ObjectInputStream.<init>(ObjectInputStream.java:358)
	at hudson.remoting.ObjectInputStreamEx.<init>(ObjectInputStreamEx.java:49)
	at hudson.remoting.Command.readFrom(Command.java:140)
	at hudson.remoting.Command.readFrom(Command.java:126)
	at hudson.remoting.AbstractSynchronousByteArrayCommandTransport.read(AbstractSynchronousByteArrayCommandTransport.java:36)
	at hudson.remoting.SynchronousCommandTransport$ReaderThread.run(SynchronousCommandTransport.java:63)
Caused: java.io.IOException: Unexpected termination of the channel
	at hudson.remoting.SynchronousCommandTransport$ReaderThread.run(SynchronousCommandTransport.java:77)
Caused: hudson.remoting.ChannelClosedException: Channel "unknown": Remote call on fi-hsw-4770 failed. The channel is closing down or has closed down
	at hudson.remoting.Channel.call(Channel.java:948)
	at hudson.FilePath.act(FilePath.java:1070)
	at hudson.FilePath.act(FilePath.java:1059)
	at hudson.FilePath.delete(FilePath.java:1563)
	at hudson.tasks.CommandInterpreter.perform(CommandInterpreter.java:123)
	at hudson.tasks.CommandInterpreter.perform(CommandInterpreter.java:66)
	at hudson.tasks.BuildStepMonitor$1.perform(BuildStepMonitor.java:20)
	at hudson.model.AbstractBuild$AbstractBuildExecution.perform(AbstractBuild.java:744)
	at hudson.model.Build$BuildExecution.build(Build.java:206)
	at hudson.model.Build$BuildExecution.doRun(Build.java:163)
	at hudson.model.AbstractBuild$AbstractBuildExecution.run(AbstractBuild.java:504)
	at hudson.model.Run.execute(Run.java:1810)
	at hudson.model.FreeStyleBuild.run(FreeStyleBuild.java:43)
	at hudson.model.ResourceController.execute(ResourceController.java:97)
	at hudson.model.Executor.run(Executor.java:429)
Build step 'Execute shell' marked build as failure
Set build name.
Workspace is not accessible
ERROR: no workspace for CI_IGT_test #2617848
Notifying upstream projects of job completion
Finished: FAILURE
Completed CI_IGT_test drmtip_150/fi-hsw-4770/16 : FAILURE
CI_IGT_test runtime 543 seconds
Rebooting fi-hsw-4770
Comment 1 Lakshmi 2019-06-14 12:05:06 UTC
Seen only once drmtip_150 (6 months, 2 weeks old). Closing as WORKSFORME.
Comment 2 CI Bug Log 2019-06-14 12:05:26 UTC
The CI Bug Log issue associated to this bug has been archived.

New failures matching the above filters will not be associated to this bug anymore.


Use of freedesktop.org services, including Bugzilla, is subject to our Code of Conduct. How we collect and use information is described in our Privacy Policy.