Bug 99764 - Make OpenMM OpenCL support work on Clover and RadeonSI
Summary: Make OpenMM OpenCL support work on Clover and RadeonSI
Status: NEW
Alias: None
Product: Mesa
Classification: Unclassified
Component: Drivers/Gallium/radeonsi (show other bugs)
Version: git
Hardware: Other All
: medium normal
Assignee: Vedran Miletić
QA Contact: Default DRI bug account
URL: http://openmm.org/
Whiteboard:
Keywords:
Depends on: 99950
Blocks: 99553
  Show dependency treegraph
 
Reported: 2017-02-10 16:04 UTC by Vedran Miletić
Modified: 2018-06-21 03:32 UTC (History)
0 users

See Also:
i915 platform:
i915 features:


Attachments

Note You need to log in before you can comment on or make changes to this bug.
Description Vedran Miletić 2017-02-10 16:04:43 UTC
How to build/test:

$ git clone https://github.com/pandegroup/openmm.git
$ cd openmm
$ mkdir build
$ cd build
$ cmake ..
$ make -j4 test

We pass three tests:

        Start  90: TestOpenCLDeviceQuerySingle
 90/235 Test  #90: TestOpenCLDeviceQuerySingle .....................   Passed    0.03 sec
        Start  91: TestOpenCLDeviceQueryMixed
 91/235 Test  #91: TestOpenCLDeviceQueryMixed ......................   Passed    0.03 sec
        Start  92: TestOpenCLDeviceQueryDouble
 92/235 Test  #92: TestOpenCLDeviceQueryDouble .....................   Passed    0.03 sec

Everything else fails with:

exception: Error compiling kernel: input.cl:124:67: warning: implicit declaration of function 'native_recip' is invalid in C99
<unknown>:0:0: in function determineNativeAccuracy void (<8 x float> addrspace(1)*, i32): unsupported call to function native_recip
Comment 1 Vedran Miletić 2017-02-14 18:21:06 UTC
With https://reviews.llvm.org/D29942 and trivially defined native_recip() in libclc more tests pass, but still not all of them.
Comment 2 Vedran Miletić 2017-02-24 18:40:34 UTC
The test results:

$ make -j8 test
Running tests...
Test project /users/miletivn/workspace/openmm/build
        Start   1: TestReferenceAndersenThermostat
  1/240 Test   #1: TestReferenceAndersenThermostat .................   Passed    0.13 sec
        Start   2: TestReferenceBrownianIntegrator
  2/240 Test   #2: TestReferenceBrownianIntegrator .................   Passed    0.09 sec
        Start   3: TestReferenceCMAPTorsionForce
  3/240 Test   #3: TestReferenceCMAPTorsionForce ...................   Passed    0.01 sec
        Start   4: TestReferenceCMMotionRemover
  4/240 Test   #4: TestReferenceCMMotionRemover ....................   Passed    0.01 sec
        Start   5: TestReferenceCheckpoints
  5/240 Test   #5: TestReferenceCheckpoints ........................   Passed    0.11 sec
        Start   6: TestReferenceCompoundIntegrator
  6/240 Test   #6: TestReferenceCompoundIntegrator .................   Passed    0.01 sec
        Start   7: TestReferenceCustomAngleForce
  7/240 Test   #7: TestReferenceCustomAngleForce ...................   Passed    0.00 sec
        Start   8: TestReferenceCustomBondForce
  8/240 Test   #8: TestReferenceCustomBondForce ....................   Passed    0.00 sec
        Start   9: TestReferenceCustomCentroidBondForce
  9/240 Test   #9: TestReferenceCustomCentroidBondForce ............   Passed    0.01 sec
        Start  10: TestReferenceCustomCompoundBondForce
 10/240 Test  #10: TestReferenceCustomCompoundBondForce ............   Passed    0.04 sec
        Start  11: TestReferenceCustomExternalForce
 11/240 Test  #11: TestReferenceCustomExternalForce ................   Passed    0.02 sec
        Start  12: TestReferenceCustomGBForce
 12/240 Test  #12: TestReferenceCustomGBForce ......................   Passed    0.16 sec
        Start  13: TestReferenceCustomHbondForce
 13/240 Test  #13: TestReferenceCustomHbondForce ...................   Passed    0.00 sec
        Start  14: TestReferenceCustomIntegrator
 14/240 Test  #14: TestReferenceCustomIntegrator ...................   Passed    0.81 sec
        Start  15: TestReferenceCustomManyParticleForce
 15/240 Test  #15: TestReferenceCustomManyParticleForce ............   Passed   12.15 sec
        Start  16: TestReferenceCustomNonbondedForce
 16/240 Test  #16: TestReferenceCustomNonbondedForce ...............   Passed    0.27 sec
        Start  17: TestReferenceCustomTorsionForce
 17/240 Test  #17: TestReferenceCustomTorsionForce .................   Passed    0.01 sec
        Start  18: TestReferenceDispersionPME
 18/240 Test  #18: TestReferenceDispersionPME ......................   Passed    1.90 sec
        Start  19: TestReferenceEwald
 19/240 Test  #19: TestReferenceEwald ..............................   Passed    0.99 sec
        Start  20: TestReferenceGBSAOBCForce
 20/240 Test  #20: TestReferenceGBSAOBCForce .......................   Passed    1.45 sec
        Start  21: TestReferenceGayBerneForce
 21/240 Test  #21: TestReferenceGayBerneForce ......................   Passed    0.05 sec
        Start  22: TestReferenceHarmonicAngleForce
 22/240 Test  #22: TestReferenceHarmonicAngleForce .................   Passed    0.01 sec
        Start  23: TestReferenceHarmonicBondForce
 23/240 Test  #23: TestReferenceHarmonicBondForce ..................   Passed    0.01 sec
        Start  24: TestReferenceKineticEnergy
 24/240 Test  #24: TestReferenceKineticEnergy ......................   Passed    0.01 sec
        Start  25: TestReferenceLangevinIntegrator
 25/240 Test  #25: TestReferenceLangevinIntegrator .................   Passed    0.13 sec
        Start  26: TestReferenceLocalEnergyMinimizer
 26/240 Test  #26: TestReferenceLocalEnergyMinimizer ...............   Passed    0.92 sec
        Start  27: TestReferenceMonteCarloAnisotropicBarostat
 27/240 Test  #27: TestReferenceMonteCarloAnisotropicBarostat ......   Passed    2.20 sec
        Start  28: TestReferenceMonteCarloBarostat
 28/240 Test  #28: TestReferenceMonteCarloBarostat .................   Passed    0.56 sec
        Start  29: TestReferenceMonteCarloMembraneBarostat
 29/240 Test  #29: TestReferenceMonteCarloMembraneBarostat .........   Passed    1.45 sec
        Start  30: TestReferenceNeighborList
 30/240 Test  #30: TestReferenceNeighborList .......................   Passed    0.05 sec
        Start  31: TestReferenceNonbondedForce
 31/240 Test  #31: TestReferenceNonbondedForce .....................   Passed    0.49 sec
        Start  32: TestReferencePeriodicTorsionForce
 32/240 Test  #32: TestReferencePeriodicTorsionForce ...............   Passed    0.00 sec
        Start  33: TestReferenceRBTorsionForce
 33/240 Test  #33: TestReferenceRBTorsionForce .....................   Passed    0.01 sec
        Start  34: TestReferenceRandom
 34/240 Test  #34: TestReferenceRandom .............................   Passed    9.07 sec
        Start  35: TestReferenceSettle
 35/240 Test  #35: TestReferenceSettle .............................   Passed    0.03 sec
        Start  36: TestReferenceVariableLangevinIntegrator
 36/240 Test  #36: TestReferenceVariableLangevinIntegrator .........   Passed   14.87 sec
        Start  37: TestReferenceVariableVerletIntegrator
 37/240 Test  #37: TestReferenceVariableVerletIntegrator ...........   Passed    2.54 sec
        Start  38: TestReferenceVerletIntegrator
 38/240 Test  #38: TestReferenceVerletIntegrator ...................   Passed    0.01 sec
        Start  39: TestReferenceVirtualSites
 39/240 Test  #39: TestReferenceVirtualSites .......................   Passed    0.18 sec
        Start  40: TestOpenCLAndersenThermostatSingle
 40/240 Test  #40: TestOpenCLAndersenThermostatSingle ..............***Exception: SegFault 55.35 sec
        Start  41: TestOpenCLAndersenThermostatMixed
 41/240 Test  #41: TestOpenCLAndersenThermostatMixed ...............***Exception: SegFault 56.00 sec
        Start  42: TestOpenCLAndersenThermostatDouble
 42/240 Test  #42: TestOpenCLAndersenThermostatDouble ..............***Exception: SegFault 65.71 sec
        Start  43: TestOpenCLBrownianIntegratorSingle
 43/240 Test  #43: TestOpenCLBrownianIntegratorSingle ..............***Exception: SegFault 43.23 sec
        Start  44: TestOpenCLBrownianIntegratorMixed
 44/240 Test  #44: TestOpenCLBrownianIntegratorMixed ...............***Exception: SegFault 43.31 sec
        Start  45: TestOpenCLBrownianIntegratorDouble
 45/240 Test  #45: TestOpenCLBrownianIntegratorDouble ..............***Exception: SegFault 43.94 sec
        Start  46: TestOpenCLCMAPTorsionForceSingle
 46/240 Test  #46: TestOpenCLCMAPTorsionForceSingle ................   Passed    6.78 sec
        Start  47: TestOpenCLCMAPTorsionForceMixed
 47/240 Test  #47: TestOpenCLCMAPTorsionForceMixed .................   Passed    7.11 sec
        Start  48: TestOpenCLCMAPTorsionForceDouble
 48/240 Test  #48: TestOpenCLCMAPTorsionForceDouble ................***Failed    2.85 sec
        Start  49: TestOpenCLCMMotionRemoverSingle
 49/240 Test  #49: TestOpenCLCMMotionRemoverSingle .................   Passed    4.43 sec
        Start  50: TestOpenCLCMMotionRemoverMixed
 50/240 Test  #50: TestOpenCLCMMotionRemoverMixed ..................   Passed    4.68 sec
        Start  51: TestOpenCLCMMotionRemoverDouble
 51/240 Test  #51: TestOpenCLCMMotionRemoverDouble .................   Passed    5.01 sec
        Start  52: TestOpenCLCheckpointsSingle
 52/240 Test  #52: TestOpenCLCheckpointsSingle .....................   Passed   10.38 sec
        Start  53: TestOpenCLCheckpointsMixed
 53/240 Test  #53: TestOpenCLCheckpointsMixed ......................   Passed   10.69 sec
        Start  54: TestOpenCLCheckpointsDouble
 54/240 Test  #54: TestOpenCLCheckpointsDouble .....................   Passed   10.96 sec
        Start  55: TestOpenCLCompoundIntegratorSingle
 55/240 Test  #55: TestOpenCLCompoundIntegratorSingle ..............   Passed    9.56 sec
        Start  56: TestOpenCLCompoundIntegratorMixed
 56/240 Test  #56: TestOpenCLCompoundIntegratorMixed ...............   Passed   10.05 sec
        Start  57: TestOpenCLCompoundIntegratorDouble
 57/240 Test  #57: TestOpenCLCompoundIntegratorDouble ..............   Passed   10.44 sec
        Start  58: TestOpenCLCustomAngleForceSingle
 58/240 Test  #58: TestOpenCLCustomAngleForceSingle ................   Passed    9.67 sec
        Start  59: TestOpenCLCustomAngleForceMixed
 59/240 Test  #59: TestOpenCLCustomAngleForceMixed .................   Passed   10.04 sec
        Start  60: TestOpenCLCustomAngleForceDouble
 60/240 Test  #60: TestOpenCLCustomAngleForceDouble ................   Passed   10.13 sec
        Start  61: TestOpenCLCustomBondForceSingle
 61/240 Test  #61: TestOpenCLCustomBondForceSingle .................   Passed    9.55 sec
        Start  62: TestOpenCLCustomBondForceMixed
 62/240 Test  #62: TestOpenCLCustomBondForceMixed ..................   Passed   10.03 sec
        Start  63: TestOpenCLCustomBondForceDouble
 63/240 Test  #63: TestOpenCLCustomBondForceDouble .................   Passed    9.87 sec
        Start  64: TestOpenCLCustomCentroidBondForceSingle
 64/240 Test  #64: TestOpenCLCustomCentroidBondForceSingle .........***Failed    1.00 sec
        Start  65: TestOpenCLCustomCentroidBondForceMixed
 65/240 Test  #65: TestOpenCLCustomCentroidBondForceMixed ..........***Failed    1.06 sec
        Start  66: TestOpenCLCustomCentroidBondForceDouble
 66/240 Test  #66: TestOpenCLCustomCentroidBondForceDouble .........***Failed    1.06 sec
        Start  67: TestOpenCLCustomCompoundBondForceSingle
 67/240 Test  #67: TestOpenCLCustomCompoundBondForceSingle .........   Passed   17.82 sec
        Start  68: TestOpenCLCustomCompoundBondForceMixed
 68/240 Test  #68: TestOpenCLCustomCompoundBondForceMixed ..........   Passed   18.55 sec
        Start  69: TestOpenCLCustomCompoundBondForceDouble
 69/240 Test  #69: TestOpenCLCustomCompoundBondForceDouble .........   Passed   18.41 sec
        Start  70: TestOpenCLCustomExternalForceSingle
 70/240 Test  #70: TestOpenCLCustomExternalForceSingle .............   Passed    9.75 sec
        Start  71: TestOpenCLCustomExternalForceMixed
 71/240 Test  #71: TestOpenCLCustomExternalForceMixed ..............   Passed   10.12 sec
        Start  72: TestOpenCLCustomExternalForceDouble
 72/240 Test  #72: TestOpenCLCustomExternalForceDouble .............   Passed    9.99 sec
        Start  73: TestOpenCLCustomGBForceSingle
 73/240 Test  #73: TestOpenCLCustomGBForceSingle ...................***Failed    3.78 sec
        Start  74: TestOpenCLCustomGBForceMixed
 74/240 Test  #74: TestOpenCLCustomGBForceMixed ....................***Failed    3.93 sec
        Start  75: TestOpenCLCustomGBForceDouble
 75/240 Test  #75: TestOpenCLCustomGBForceDouble ...................***Failed    1.66 sec
        Start  76: TestOpenCLCustomHbondForceSingle
 76/240 Test  #76: TestOpenCLCustomHbondForceSingle ................   Passed    7.81 sec
        Start  77: TestOpenCLCustomHbondForceMixed
 77/240 Test  #77: TestOpenCLCustomHbondForceMixed .................   Passed    8.07 sec
        Start  78: TestOpenCLCustomHbondForceDouble
 78/240 Test  #78: TestOpenCLCustomHbondForceDouble ................   Passed    8.14 sec
        Start  79: TestOpenCLCustomIntegratorSingle
 79/240 Test  #79: TestOpenCLCustomIntegratorSingle ................***Exception: SegFault 69.80 sec
        Start  80: TestOpenCLCustomIntegratorMixed
 80/240 Test  #80: TestOpenCLCustomIntegratorMixed .................***Exception: SegFault 70.70 sec
        Start  81: TestOpenCLCustomIntegratorDouble
 81/240 Test  #81: TestOpenCLCustomIntegratorDouble ................***Exception: SegFault 73.77 sec
        Start  82: TestOpenCLCustomManyParticleForceSingle
 82/240 Test  #82: TestOpenCLCustomManyParticleForceSingle .........***Failed    1.05 sec
        Start  83: TestOpenCLCustomManyParticleForceMixed
 83/240 Test  #83: TestOpenCLCustomManyParticleForceMixed ..........***Failed    1.11 sec
        Start  84: TestOpenCLCustomManyParticleForceDouble
 84/240 Test  #84: TestOpenCLCustomManyParticleForceDouble .........***Failed    1.15 sec
        Start  85: TestOpenCLCustomNonbondedForceSingle
 85/240 Test  #85: TestOpenCLCustomNonbondedForceSingle ............   Passed   58.06 sec
        Start  86: TestOpenCLCustomNonbondedForceMixed
 86/240 Test  #86: TestOpenCLCustomNonbondedForceMixed .............   Passed   60.29 sec
        Start  87: TestOpenCLCustomNonbondedForceDouble
 87/240 Test  #87: TestOpenCLCustomNonbondedForceDouble ............   Passed   61.64 sec
        Start  88: TestOpenCLCustomTorsionForceSingle
 88/240 Test  #88: TestOpenCLCustomTorsionForceSingle ..............   Passed   11.98 sec
        Start  89: TestOpenCLCustomTorsionForceMixed
 89/240 Test  #89: TestOpenCLCustomTorsionForceMixed ...............   Passed   12.61 sec
        Start  90: TestOpenCLCustomTorsionForceDouble
 90/240 Test  #90: TestOpenCLCustomTorsionForceDouble ..............***Failed    2.90 sec
        Start  91: TestOpenCLDeviceQuerySingle
 91/240 Test  #91: TestOpenCLDeviceQuerySingle .....................   Passed    0.03 sec
        Start  92: TestOpenCLDeviceQueryMixed
 92/240 Test  #92: TestOpenCLDeviceQueryMixed ......................   Passed    0.02 sec
        Start  93: TestOpenCLDeviceQueryDouble
 93/240 Test  #93: TestOpenCLDeviceQueryDouble .....................   Passed    0.02 sec
        Start  94: TestOpenCLDispersionPMESingle
 94/240 Test  #94: TestOpenCLDispersionPMESingle ...................***Failed    6.35 sec
        Start  95: TestOpenCLDispersionPMEMixed
 95/240 Test  #95: TestOpenCLDispersionPMEMixed ....................***Failed    6.43 sec
        Start  96: TestOpenCLDispersionPMEDouble
 96/240 Test  #96: TestOpenCLDispersionPMEDouble ...................***Failed  192.25 sec
        Start  97: TestOpenCLEwaldSingle
 97/240 Test  #97: TestOpenCLEwaldSingle ...........................***Failed    2.57 sec
        Start  98: TestOpenCLEwaldMixed
 98/240 Test  #98: TestOpenCLEwaldMixed ............................***Failed    2.59 sec
        Start  99: TestOpenCLEwaldDouble
 99/240 Test  #99: TestOpenCLEwaldDouble ...........................   Passed  240.06 sec
        Start 100: TestOpenCLFFTSingle
100/240 Test #100: TestOpenCLFFTSingle .............................   Passed   13.50 sec
        Start 101: TestOpenCLFFTMixed
101/240 Test #101: TestOpenCLFFTMixed ..............................   Passed   14.36 sec
        Start 102: TestOpenCLFFTDouble
102/240 Test #102: TestOpenCLFFTDouble .............................   Passed   11.84 sec
        Start 103: TestOpenCLGBSAOBCForceSingle
103/240 Test #103: TestOpenCLGBSAOBCForceSingle ....................***Failed   16.72 sec
        Start 104: TestOpenCLGBSAOBCForceMixed
104/240 Test #104: TestOpenCLGBSAOBCForceMixed .....................***Failed   17.03 sec
        Start 105: TestOpenCLGBSAOBCForceDouble
105/240 Test #105: TestOpenCLGBSAOBCForceDouble ....................***Failed    2.04 sec
        Start 106: TestOpenCLGayBerneForceSingle
106/240 Test #106: TestOpenCLGayBerneForceSingle ...................***Failed    1.18 sec
        Start 107: TestOpenCLGayBerneForceMixed
107/240 Test #107: TestOpenCLGayBerneForceMixed ....................***Failed    1.10 sec
        Start 108: TestOpenCLGayBerneForceDouble
108/240 Test #108: TestOpenCLGayBerneForceDouble ...................***Failed    1.08 sec
        Start 109: TestOpenCLHarmonicAngleForceSingle
109/240 Test #109: TestOpenCLHarmonicAngleForceSingle ..............   Passed    6.24 sec
        Start 110: TestOpenCLHarmonicAngleForceMixed
110/240 Test #110: TestOpenCLHarmonicAngleForceMixed ...............   Passed    6.57 sec
        Start 111: TestOpenCLHarmonicAngleForceDouble
111/240 Test #111: TestOpenCLHarmonicAngleForceDouble ..............   Passed    6.56 sec
        Start 112: TestOpenCLHarmonicBondForceSingle
112/240 Test #112: TestOpenCLHarmonicBondForceSingle ...............   Passed    6.23 sec
        Start 113: TestOpenCLHarmonicBondForceMixed
113/240 Test #113: TestOpenCLHarmonicBondForceMixed ................   Passed    6.60 sec
        Start 114: TestOpenCLHarmonicBondForceDouble
114/240 Test #114: TestOpenCLHarmonicBondForceDouble ...............   Passed    6.50 sec
        Start 115: TestOpenCLLangevinIntegratorSingle
115/240 Test #115: TestOpenCLLangevinIntegratorSingle ..............***Exception: SegFault 37.33 sec
        Start 116: TestOpenCLLangevinIntegratorMixed
116/240 Test #116: TestOpenCLLangevinIntegratorMixed ...............***Exception: SegFault 37.63 sec
        Start 117: TestOpenCLLangevinIntegratorDouble
117/240 Test #117: TestOpenCLLangevinIntegratorDouble ..............***Exception: SegFault 43.70 sec
        Start 118: TestOpenCLLocalEnergyMinimizerSingle
118/240 Test #118: TestOpenCLLocalEnergyMinimizerSingle ............   Passed    9.07 sec
        Start 119: TestOpenCLLocalEnergyMinimizerMixed
119/240 Test #119: TestOpenCLLocalEnergyMinimizerMixed .............   Passed    7.73 sec
        Start 120: TestOpenCLLocalEnergyMinimizerDouble
120/240 Test #120: TestOpenCLLocalEnergyMinimizerDouble ............   Passed   11.78 sec
        Start 121: TestOpenCLMonteCarloAnisotropicBarostatSingle
121/240 Test #121: TestOpenCLMonteCarloAnisotropicBarostatSingle ...   Passed   66.39 sec
        Start 122: TestOpenCLMonteCarloAnisotropicBarostatMixed
122/240 Test #122: TestOpenCLMonteCarloAnisotropicBarostatMixed ....   Passed   70.76 sec
        Start 123: TestOpenCLMonteCarloAnisotropicBarostatDouble
123/240 Test #123: TestOpenCLMonteCarloAnisotropicBarostatDouble ...   Passed   71.83 sec
        Start 124: TestOpenCLMonteCarloBarostatSingle
124/240 Test #124: TestOpenCLMonteCarloBarostatSingle ..............   Passed   33.83 sec
        Start 125: TestOpenCLMonteCarloBarostatMixed
125/240 Test #125: TestOpenCLMonteCarloBarostatMixed ...............   Passed   35.86 sec
        Start 126: TestOpenCLMonteCarloBarostatDouble
126/240 Test #126: TestOpenCLMonteCarloBarostatDouble ..............   Passed   47.49 sec
        Start 127: TestOpenCLMultipleForcesSingle
127/240 Test #127: TestOpenCLMultipleForcesSingle ..................   Passed    1.89 sec
        Start 128: TestOpenCLMultipleForcesMixed
128/240 Test #128: TestOpenCLMultipleForcesMixed ...................   Passed    1.96 sec
        Start 129: TestOpenCLMultipleForcesDouble
129/240 Test #129: TestOpenCLMultipleForcesDouble ..................***Failed    1.85 sec
        Start 130: TestOpenCLNonbondedForceSingle
130/240 Test #130: TestOpenCLNonbondedForceSingle ..................***Failed   50.08 sec
        Start 131: TestOpenCLNonbondedForceMixed
131/240 Test #131: TestOpenCLNonbondedForceMixed ...................***Failed   51.88 sec
        Start 132: TestOpenCLNonbondedForceDouble
132/240 Test #132: TestOpenCLNonbondedForceDouble ..................   Passed   82.20 sec
        Start 133: TestOpenCLPeriodicTorsionForceSingle
133/240 Test #133: TestOpenCLPeriodicTorsionForceSingle ............   Passed    7.10 sec
        Start 134: TestOpenCLPeriodicTorsionForceMixed
134/240 Test #134: TestOpenCLPeriodicTorsionForceMixed .............   Passed    7.33 sec
        Start 135: TestOpenCLPeriodicTorsionForceDouble
135/240 Test #135: TestOpenCLPeriodicTorsionForceDouble ............   Passed    7.01 sec
        Start 136: TestOpenCLRBTorsionForceSingle
136/240 Test #136: TestOpenCLRBTorsionForceSingle ..................   Passed    6.71 sec
        Start 137: TestOpenCLRBTorsionForceMixed
137/240 Test #137: TestOpenCLRBTorsionForceMixed ...................   Passed    7.13 sec
        Start 138: TestOpenCLRBTorsionForceDouble
138/240 Test #138: TestOpenCLRBTorsionForceDouble ..................   Passed    7.27 sec
        Start 139: TestOpenCLRandomSingle
139/240 Test #139: TestOpenCLRandomSingle ..........................   Passed    3.52 sec
        Start 140: TestOpenCLRandomMixed
140/240 Test #140: TestOpenCLRandomMixed ...........................   Passed    3.63 sec
        Start 141: TestOpenCLRandomDouble
141/240 Test #141: TestOpenCLRandomDouble ..........................   Passed    3.62 sec
        Start 142: TestOpenCLSettleSingle
142/240 Test #142: TestOpenCLSettleSingle ..........................   Passed    2.40 sec
        Start 143: TestOpenCLSettleMixed
143/240 Test #143: TestOpenCLSettleMixed ...........................   Passed    2.65 sec
        Start 144: TestOpenCLSettleDouble
144/240 Test #144: TestOpenCLSettleDouble ..........................   Passed    2.88 sec
        Start 145: TestOpenCLSortSingle
145/240 Test #145: TestOpenCLSortSingle ............................   Passed    3.67 sec
        Start 146: TestOpenCLSortMixed
146/240 Test #146: TestOpenCLSortMixed .............................   Passed    3.81 sec
        Start 147: TestOpenCLSortDouble
147/240 Test #147: TestOpenCLSortDouble ............................   Passed    3.76 sec
        Start 148: TestOpenCLVariableLangevinIntegratorSingle
148/240 Test #148: TestOpenCLVariableLangevinIntegratorSingle ......***Exception: SegFault 41.50 sec
        Start 149: TestOpenCLVariableLangevinIntegratorMixed
149/240 Test #149: TestOpenCLVariableLangevinIntegratorMixed .......***Exception: SegFault 42.36 sec
        Start 150: TestOpenCLVariableLangevinIntegratorDouble
150/240 Test #150: TestOpenCLVariableLangevinIntegratorDouble ......***Exception: SegFault 51.86 sec
        Start 151: TestOpenCLVariableVerletIntegratorSingle
151/240 Test #151: TestOpenCLVariableVerletIntegratorSingle ........   Passed   12.88 sec
        Start 152: TestOpenCLVariableVerletIntegratorMixed
152/240 Test #152: TestOpenCLVariableVerletIntegratorMixed .........   Passed   13.86 sec
        Start 153: TestOpenCLVariableVerletIntegratorDouble
153/240 Test #153: TestOpenCLVariableVerletIntegratorDouble ........   Passed   14.92 sec
        Start 154: TestOpenCLVerletIntegratorSingle
154/240 Test #154: TestOpenCLVerletIntegratorSingle ................   Passed   10.27 sec
        Start 155: TestOpenCLVerletIntegratorMixed
155/240 Test #155: TestOpenCLVerletIntegratorMixed .................   Passed   10.46 sec
        Start 156: TestOpenCLVerletIntegratorDouble
156/240 Test #156: TestOpenCLVerletIntegratorDouble ................   Passed   11.13 sec
        Start 157: TestOpenCLVirtualSitesSingle
157/240 Test #157: TestOpenCLVirtualSitesSingle ....................   Passed   18.89 sec
        Start 158: TestOpenCLVirtualSitesMixed
158/240 Test #158: TestOpenCLVirtualSitesMixed .....................   Passed   20.25 sec
        Start 159: TestOpenCLVirtualSitesDouble
159/240 Test #159: TestOpenCLVirtualSitesDouble ....................***Failed   15.38 sec
        Start 160: TestCpuCheckpoints
160/240 Test #160: TestCpuCheckpoints ..............................   Passed    0.06 sec
        Start 161: TestCpuCompoundIntegrator
161/240 Test #161: TestCpuCompoundIntegrator .......................   Passed    2.47 sec
        Start 162: TestCpuCustomGBForce
162/240 Test #162: TestCpuCustomGBForce ............................   Passed    0.19 sec
        Start 163: TestCpuCustomManyParticleForce
163/240 Test #163: TestCpuCustomManyParticleForce ..................   Passed    8.03 sec
        Start 164: TestCpuCustomNonbondedForce
164/240 Test #164: TestCpuCustomNonbondedForce .....................   Passed    0.23 sec
        Start 165: TestCpuDispersionPME
165/240 Test #165: TestCpuDispersionPME ............................   Passed    1.89 sec
        Start 166: TestCpuEwald
166/240 Test #166: TestCpuEwald ....................................   Passed    1.04 sec
        Start 167: TestCpuGBSAOBCForce
167/240 Test #167: TestCpuGBSAOBCForce .............................   Passed    0.58 sec
        Start 168: TestCpuGayBerneForce
168/240 Test #168: TestCpuGayBerneForce ............................   Passed    0.09 sec
        Start 169: TestCpuHarmonicAngleForce
169/240 Test #169: TestCpuHarmonicAngleForce .......................   Passed    0.02 sec
        Start 170: TestCpuLangevinIntegrator
170/240 Test #170: TestCpuLangevinIntegrator .......................   Passed    4.71 sec
        Start 171: TestCpuNeighborList
171/240 Test #171: TestCpuNeighborList .............................   Passed    0.08 sec
        Start 172: TestCpuNonbondedForce
172/240 Test #172: TestCpuNonbondedForce ...........................   Passed    0.37 sec
        Start 173: TestCpuPeriodicTorsionForce
173/240 Test #173: TestCpuPeriodicTorsionForce .....................   Passed    0.00 sec
        Start 174: TestCpuRBTorsionForce
174/240 Test #174: TestCpuRBTorsionForce ...........................   Passed    0.01 sec
        Start 175: TestCpuSettle
175/240 Test #175: TestCpuSettle ...................................   Passed    0.30 sec
        Start 176: TestReferenceAmoebaAngleForce
176/240 Test #176: TestReferenceAmoebaAngleForce ...................   Passed    0.01 sec
        Start 177: TestReferenceAmoebaBondForce
177/240 Test #177: TestReferenceAmoebaBondForce ....................   Passed    0.00 sec
        Start 178: TestReferenceAmoebaExtrapolatedPolarization
178/240 Test #178: TestReferenceAmoebaExtrapolatedPolarization .....   Passed    1.05 sec
        Start 179: TestReferenceAmoebaGeneralizedKirkwoodForce
179/240 Test #179: TestReferenceAmoebaGeneralizedKirkwoodForce .....   Passed    5.30 sec
        Start 180: TestReferenceAmoebaInPlaneAngleForce
180/240 Test #180: TestReferenceAmoebaInPlaneAngleForce ............   Passed    0.00 sec
        Start 181: TestReferenceAmoebaMultipoleForce
181/240 Test #181: TestReferenceAmoebaMultipoleForce ...............   Passed    0.93 sec
        Start 182: TestReferenceAmoebaOutOfPlaneBendForce
182/240 Test #182: TestReferenceAmoebaOutOfPlaneBendForce ..........   Passed    0.00 sec
        Start 183: TestReferenceAmoebaPiTorsionForce
183/240 Test #183: TestReferenceAmoebaPiTorsionForce ...............   Passed    0.00 sec
        Start 184: TestReferenceAmoebaStretchBendForce
184/240 Test #184: TestReferenceAmoebaStretchBendForce .............   Passed    0.00 sec
        Start 185: TestReferenceAmoebaTorsionTorsionForce
185/240 Test #185: TestReferenceAmoebaTorsionTorsionForce ..........   Passed    0.00 sec
        Start 186: TestReferenceAmoebaVdwForce
186/240 Test #186: TestReferenceAmoebaVdwForce .....................   Passed    0.08 sec
        Start 187: TestReferenceWcaDispersionForce
187/240 Test #187: TestReferenceWcaDispersionForce .................   Passed    0.00 sec
        Start 188: TestReferenceRpmd
188/240 Test #188: TestReferenceRpmd ...............................   Passed   18.00 sec
        Start 189: TestOpenCLRpmdSingle
189/240 Test #189: TestOpenCLRpmdSingle ............................***Exception: SegFault 39.52 sec
        Start 190: TestOpenCLRpmdMixed
190/240 Test #190: TestOpenCLRpmdMixed .............................***Exception: SegFault 40.57 sec
        Start 191: TestOpenCLRpmdDouble
191/240 Test #191: TestOpenCLRpmdDouble ............................***Exception: SegFault 39.31 sec
        Start 192: TestReferenceDrudeForce
192/240 Test #192: TestReferenceDrudeForce .........................   Passed    0.04 sec
        Start 193: TestReferenceDrudeLangevinIntegrator
193/240 Test #193: TestReferenceDrudeLangevinIntegrator ............   Passed    5.62 sec
        Start 194: TestReferenceDrudeSCFIntegrator
194/240 Test #194: TestReferenceDrudeSCFIntegrator .................   Passed    7.39 sec
        Start 195: TestOpenCLDrudeForceSingle
195/240 Test #195: TestOpenCLDrudeForceSingle ......................   Passed    5.78 sec
        Start 196: TestOpenCLDrudeForceMixed
196/240 Test #196: TestOpenCLDrudeForceMixed .......................   Passed    5.94 sec
        Start 197: TestOpenCLDrudeForceDouble
197/240 Test #197: TestOpenCLDrudeForceDouble ......................   Passed    5.64 sec
        Start 198: TestOpenCLDrudeLangevinIntegratorSingle
198/240 Test #198: TestOpenCLDrudeLangevinIntegratorSingle .........***Exception: SegFault 42.70 sec
        Start 199: TestOpenCLDrudeLangevinIntegratorMixed
199/240 Test #199: TestOpenCLDrudeLangevinIntegratorMixed ..........***Exception: SegFault 45.54 sec
        Start 200: TestOpenCLDrudeLangevinIntegratorDouble
200/240 Test #200: TestOpenCLDrudeLangevinIntegratorDouble .........***Exception: SegFault 46.91 sec
        Start 201: TestOpenCLDrudeSCFIntegratorSingle
201/240 Test #201: TestOpenCLDrudeSCFIntegratorSingle ..............   Passed   27.00 sec
        Start 202: TestOpenCLDrudeSCFIntegratorMixed
202/240 Test #202: TestOpenCLDrudeSCFIntegratorMixed ...............   Passed   27.65 sec
        Start 203: TestOpenCLDrudeSCFIntegratorDouble
203/240 Test #203: TestOpenCLDrudeSCFIntegratorDouble ..............   Passed   23.04 sec
        Start 204: TestCpuPme
204/240 Test #204: TestCpuPme ......................................   Passed    0.60 sec
        Start 205: TestSerializationNode
205/240 Test #205: TestSerializationNode ...........................   Passed    0.02 sec
        Start 206: TestSerializeAndersenThermostat
206/240 Test #206: TestSerializeAndersenThermostat .................   Passed    0.00 sec
        Start 207: TestSerializeCMAPTorsion
207/240 Test #207: TestSerializeCMAPTorsion ........................   Passed    0.00 sec
        Start 208: TestSerializeCMMotionRemover
208/240 Test #208: TestSerializeCMMotionRemover ....................   Passed    0.01 sec
        Start 209: TestSerializeCustomAngleForce
209/240 Test #209: TestSerializeCustomAngleForce ...................   Passed    0.01 sec
        Start 210: TestSerializeCustomBondForce
210/240 Test #210: TestSerializeCustomBondForce ....................   Passed    0.01 sec
        Start 211: TestSerializeCustomCentroidBondForce
211/240 Test #211: TestSerializeCustomCentroidBondForce ............   Passed    0.02 sec
        Start 212: TestSerializeCustomCompoundBondForce
212/240 Test #212: TestSerializeCustomCompoundBondForce ............   Passed    0.01 sec
        Start 213: TestSerializeCustomExternalForce
213/240 Test #213: TestSerializeCustomExternalForce ................   Passed    0.01 sec
        Start 214: TestSerializeCustomGBForce
214/240 Test #214: TestSerializeCustomGBForce ......................   Passed    0.00 sec
        Start 215: TestSerializeCustomHbondForce
215/240 Test #215: TestSerializeCustomHbondForce ...................   Passed    0.00 sec
        Start 216: TestSerializeCustomManyParticleForce
216/240 Test #216: TestSerializeCustomManyParticleForce ............   Passed    0.00 sec
        Start 217: TestSerializeCustomNonbondedForce
217/240 Test #217: TestSerializeCustomNonbondedForce ...............   Passed    0.00 sec
        Start 218: TestSerializeCustomTorsionForce
218/240 Test #218: TestSerializeCustomTorsionForce .................   Passed    0.00 sec
        Start 219: TestSerializeGBSAOBCForce
219/240 Test #219: TestSerializeGBSAOBCForce .......................   Passed    0.00 sec
        Start 220: TestSerializeGayBerneForce
220/240 Test #220: TestSerializeGayBerneForce ......................   Passed    0.00 sec
        Start 221: TestSerializeHarmonicAngleForce
221/240 Test #221: TestSerializeHarmonicAngleForce .................   Passed    0.00 sec
        Start 222: TestSerializeHarmonicBondForce
222/240 Test #222: TestSerializeHarmonicBondForce ..................   Passed    0.00 sec
        Start 223: TestSerializeIntegrator
223/240 Test #223: TestSerializeIntegrator .........................   Passed    0.01 sec
        Start 224: TestSerializeMonteCarloAnisotropicBarostat
224/240 Test #224: TestSerializeMonteCarloAnisotropicBarostat ......   Passed    0.00 sec
        Start 225: TestSerializeMonteCarloBarostat
225/240 Test #225: TestSerializeMonteCarloBarostat .................   Passed    0.00 sec
        Start 226: TestSerializeMonteCarloMembraneBarostat
226/240 Test #226: TestSerializeMonteCarloMembraneBarostat .........   Passed    0.00 sec
        Start 227: TestSerializeNonbondedForce
227/240 Test #227: TestSerializeNonbondedForce .....................   Passed    0.00 sec
        Start 228: TestSerializePeriodicTorsionForce
228/240 Test #228: TestSerializePeriodicTorsionForce ...............   Passed    0.00 sec
        Start 229: TestSerializeRBTorsionForce
229/240 Test #229: TestSerializeRBTorsionForce .....................   Passed    0.00 sec
        Start 230: TestSerializeState
230/240 Test #230: TestSerializeState ..............................   Passed    0.01 sec
        Start 231: TestSerializeSystem
231/240 Test #231: TestSerializeSystem .............................   Passed    0.03 sec
        Start 232: TestSerializeTabulatedFunctions
232/240 Test #232: TestSerializeTabulatedFunctions .................   Passed    0.01 sec
        Start 233: TestEnforcePeriodicBox
233/240 Test #233: TestEnforcePeriodicBox ..........................   Passed    0.01 sec
        Start 234: TestFindExclusions
234/240 Test #234: TestFindExclusions ..............................   Passed    0.00 sec
        Start 235: TestFindMolecules
235/240 Test #235: TestFindMolecules ...............................   Passed    0.01 sec
        Start 236: TestParser
236/240 Test #236: TestParser ......................................   Passed    0.01 sec
        Start 237: TestSplineFitter
237/240 Test #237: TestSplineFitter ................................   Passed    0.00 sec
        Start 238: TestSystem
238/240 Test #238: TestSystem ......................................   Passed    0.00 sec
        Start 239: TestVectorize
239/240 Test #239: TestVectorize ...................................   Passed    0.01 sec
        Start 240: TestVectorize8
240/240 Test #240: TestVectorize8 ..................................   Passed    0.00 sec

80% tests passed, 47 tests failed out of 240

Total Test time (real) = 3033.01 sec

The following tests FAILED:
	 40 - TestOpenCLAndersenThermostatSingle (SEGFAULT)
	 41 - TestOpenCLAndersenThermostatMixed (SEGFAULT)
	 42 - TestOpenCLAndersenThermostatDouble (SEGFAULT)
	 43 - TestOpenCLBrownianIntegratorSingle (SEGFAULT)
	 44 - TestOpenCLBrownianIntegratorMixed (SEGFAULT)
	 45 - TestOpenCLBrownianIntegratorDouble (SEGFAULT)
	 48 - TestOpenCLCMAPTorsionForceDouble (Failed)
	 64 - TestOpenCLCustomCentroidBondForceSingle (Failed)
	 65 - TestOpenCLCustomCentroidBondForceMixed (Failed)
	 66 - TestOpenCLCustomCentroidBondForceDouble (Failed)
	 73 - TestOpenCLCustomGBForceSingle (Failed)
	 74 - TestOpenCLCustomGBForceMixed (Failed)
	 75 - TestOpenCLCustomGBForceDouble (Failed)
	 79 - TestOpenCLCustomIntegratorSingle (SEGFAULT)
	 80 - TestOpenCLCustomIntegratorMixed (SEGFAULT)
	 81 - TestOpenCLCustomIntegratorDouble (SEGFAULT)
	 82 - TestOpenCLCustomManyParticleForceSingle (Failed)
	 83 - TestOpenCLCustomManyParticleForceMixed (Failed)
	 84 - TestOpenCLCustomManyParticleForceDouble (Failed)
	 90 - TestOpenCLCustomTorsionForceDouble (Failed)
	 94 - TestOpenCLDispersionPMESingle (Failed)
	 95 - TestOpenCLDispersionPMEMixed (Failed)
	 96 - TestOpenCLDispersionPMEDouble (Failed)
	 97 - TestOpenCLEwaldSingle (Failed)
	 98 - TestOpenCLEwaldMixed (Failed)
	103 - TestOpenCLGBSAOBCForceSingle (Failed)
	104 - TestOpenCLGBSAOBCForceMixed (Failed)
	105 - TestOpenCLGBSAOBCForceDouble (Failed)
	106 - TestOpenCLGayBerneForceSingle (Failed)
	107 - TestOpenCLGayBerneForceMixed (Failed)
	108 - TestOpenCLGayBerneForceDouble (Failed)
	115 - TestOpenCLLangevinIntegratorSingle (SEGFAULT)
	116 - TestOpenCLLangevinIntegratorMixed (SEGFAULT)
	117 - TestOpenCLLangevinIntegratorDouble (SEGFAULT)
	129 - TestOpenCLMultipleForcesDouble (Failed)
	130 - TestOpenCLNonbondedForceSingle (Failed)
	131 - TestOpenCLNonbondedForceMixed (Failed)
	148 - TestOpenCLVariableLangevinIntegratorSingle (SEGFAULT)
	149 - TestOpenCLVariableLangevinIntegratorMixed (SEGFAULT)
	150 - TestOpenCLVariableLangevinIntegratorDouble (SEGFAULT)
	159 - TestOpenCLVirtualSitesDouble (Failed)
	189 - TestOpenCLRpmdSingle (SEGFAULT)
	190 - TestOpenCLRpmdMixed (SEGFAULT)
	191 - TestOpenCLRpmdDouble (SEGFAULT)
	198 - TestOpenCLDrudeLangevinIntegratorSingle (SEGFAULT)
	199 - TestOpenCLDrudeLangevinIntegratorMixed (SEGFAULT)
	200 - TestOpenCLDrudeLangevinIntegratorDouble (SEGFAULT)
Errors while running CTest
Makefile:127: recipe for target 'test' failed
make: *** [test] Error 8
Comment 3 Vedran Miletić 2017-03-13 19:49:06 UTC
With the patches:
https://lists.freedesktop.org/archives/mesa-dev/2017-March/147101.html
https://lists.freedesktop.org/archives/mesa-dev/2017-March/147779.html

we are down to

Running tests...
Test project /users/miletivn/workspace/openmm/build
        Start   1: TestReferenceAndersenThermostat
  1/240 Test   #1: TestReferenceAndersenThermostat .................   Passed    0.92 sec
        Start   2: TestReferenceBrownianIntegrator
  2/240 Test   #2: TestReferenceBrownianIntegrator .................   Passed    0.41 sec
        Start   3: TestReferenceCMAPTorsionForce
  3/240 Test   #3: TestReferenceCMAPTorsionForce ...................   Passed    0.04 sec
        Start   4: TestReferenceCMMotionRemover
  4/240 Test   #4: TestReferenceCMMotionRemover ....................   Passed    0.03 sec
        Start   5: TestReferenceCheckpoints
  5/240 Test   #5: TestReferenceCheckpoints ........................   Passed    1.06 sec
        Start   6: TestReferenceCompoundIntegrator
  6/240 Test   #6: TestReferenceCompoundIntegrator .................   Passed    0.04 sec
        Start   7: TestReferenceCustomAngleForce
  7/240 Test   #7: TestReferenceCustomAngleForce ...................   Passed    0.02 sec
        Start   8: TestReferenceCustomBondForce
  8/240 Test   #8: TestReferenceCustomBondForce ....................   Passed    0.04 sec
        Start   9: TestReferenceCustomCentroidBondForce
  9/240 Test   #9: TestReferenceCustomCentroidBondForce ............   Passed    0.06 sec
        Start  10: TestReferenceCustomCompoundBondForce
 10/240 Test  #10: TestReferenceCustomCompoundBondForce ............   Passed    0.12 sec
        Start  11: TestReferenceCustomExternalForce
 11/240 Test  #11: TestReferenceCustomExternalForce ................   Passed    0.07 sec
        Start  12: TestReferenceCustomGBForce
 12/240 Test  #12: TestReferenceCustomGBForce ......................   Passed    0.61 sec
        Start  13: TestReferenceCustomHbondForce
 13/240 Test  #13: TestReferenceCustomHbondForce ...................   Passed    0.01 sec
        Start  14: TestReferenceCustomIntegrator
 14/240 Test  #14: TestReferenceCustomIntegrator ...................   Passed    4.98 sec
        Start  15: TestReferenceCustomManyParticleForce
 15/240 Test  #15: TestReferenceCustomManyParticleForce ............   Passed   78.61 sec
        Start  16: TestReferenceCustomNonbondedForce
 16/240 Test  #16: TestReferenceCustomNonbondedForce ...............   Passed    1.37 sec
        Start  17: TestReferenceCustomTorsionForce
 17/240 Test  #17: TestReferenceCustomTorsionForce .................   Passed    0.02 sec
        Start  18: TestReferenceDispersionPME
 18/240 Test  #18: TestReferenceDispersionPME ......................   Passed    9.10 sec
        Start  19: TestReferenceEwald
 19/240 Test  #19: TestReferenceEwald ..............................   Passed    5.20 sec
        Start  20: TestReferenceGBSAOBCForce
 20/240 Test  #20: TestReferenceGBSAOBCForce .......................   Passed    5.24 sec
        Start  21: TestReferenceGayBerneForce
 21/240 Test  #21: TestReferenceGayBerneForce ......................   Passed    0.15 sec
        Start  22: TestReferenceHarmonicAngleForce
 22/240 Test  #22: TestReferenceHarmonicAngleForce .................   Passed    0.00 sec
        Start  23: TestReferenceHarmonicBondForce
 23/240 Test  #23: TestReferenceHarmonicBondForce ..................   Passed    0.12 sec
        Start  24: TestReferenceKineticEnergy
 24/240 Test  #24: TestReferenceKineticEnergy ......................   Passed    0.02 sec
        Start  25: TestReferenceLangevinIntegrator
 25/240 Test  #25: TestReferenceLangevinIntegrator .................   Passed    0.31 sec
        Start  26: TestReferenceLocalEnergyMinimizer
 26/240 Test  #26: TestReferenceLocalEnergyMinimizer ...............   Passed    5.11 sec
        Start  27: TestReferenceMonteCarloAnisotropicBarostat
 27/240 Test  #27: TestReferenceMonteCarloAnisotropicBarostat ......   Passed    6.45 sec
        Start  28: TestReferenceMonteCarloBarostat
 28/240 Test  #28: TestReferenceMonteCarloBarostat .................   Passed    1.48 sec
        Start  29: TestReferenceMonteCarloMembraneBarostat
 29/240 Test  #29: TestReferenceMonteCarloMembraneBarostat .........   Passed    5.98 sec
        Start  30: TestReferenceNeighborList
 30/240 Test  #30: TestReferenceNeighborList .......................   Passed    0.26 sec
        Start  31: TestReferenceNonbondedForce
 31/240 Test  #31: TestReferenceNonbondedForce .....................   Passed    1.80 sec
        Start  32: TestReferencePeriodicTorsionForce
 32/240 Test  #32: TestReferencePeriodicTorsionForce ...............   Passed    0.02 sec
        Start  33: TestReferenceRBTorsionForce
 33/240 Test  #33: TestReferenceRBTorsionForce .....................   Passed    0.00 sec
        Start  34: TestReferenceRandom
 34/240 Test  #34: TestReferenceRandom .............................   Passed    3.68 sec
        Start  35: TestReferenceSettle
 35/240 Test  #35: TestReferenceSettle .............................   Passed    0.15 sec
        Start  36: TestReferenceVariableLangevinIntegrator
 36/240 Test  #36: TestReferenceVariableLangevinIntegrator .........   Passed  124.26 sec
        Start  37: TestReferenceVariableVerletIntegrator
 37/240 Test  #37: TestReferenceVariableVerletIntegrator ...........   Passed   20.94 sec
        Start  38: TestReferenceVerletIntegrator
 38/240 Test  #38: TestReferenceVerletIntegrator ...................   Passed    0.10 sec
        Start  39: TestReferenceVirtualSites
 39/240 Test  #39: TestReferenceVirtualSites .......................   Passed    0.87 sec
        Start  40: TestOpenCLAndersenThermostatSingle
 40/240 Test  #40: TestOpenCLAndersenThermostatSingle ..............   Passed   65.02 sec
        Start  41: TestOpenCLAndersenThermostatMixed
 41/240 Test  #41: TestOpenCLAndersenThermostatMixed ...............   Passed   65.62 sec
        Start  42: TestOpenCLAndersenThermostatDouble
 42/240 Test  #42: TestOpenCLAndersenThermostatDouble ..............   Passed   84.99 sec
        Start  43: TestOpenCLBrownianIntegratorSingle
 43/240 Test  #43: TestOpenCLBrownianIntegratorSingle ..............   Passed   42.78 sec
        Start  44: TestOpenCLBrownianIntegratorMixed
 44/240 Test  #44: TestOpenCLBrownianIntegratorMixed ...............   Passed   43.90 sec
        Start  45: TestOpenCLBrownianIntegratorDouble
 45/240 Test  #45: TestOpenCLBrownianIntegratorDouble ..............   Passed   43.38 sec
        Start  46: TestOpenCLCMAPTorsionForceSingle
 46/240 Test  #46: TestOpenCLCMAPTorsionForceSingle ................   Passed   11.27 sec
        Start  47: TestOpenCLCMAPTorsionForceMixed
 47/240 Test  #47: TestOpenCLCMAPTorsionForceMixed .................   Passed   11.87 sec
        Start  48: TestOpenCLCMAPTorsionForceDouble
 48/240 Test  #48: TestOpenCLCMAPTorsionForceDouble ................   Passed   12.20 sec
        Start  49: TestOpenCLCMMotionRemoverSingle
 49/240 Test  #49: TestOpenCLCMMotionRemoverSingle .................   Passed    6.94 sec
        Start  50: TestOpenCLCMMotionRemoverMixed
 50/240 Test  #50: TestOpenCLCMMotionRemoverMixed ..................   Passed    7.18 sec
        Start  51: TestOpenCLCMMotionRemoverDouble
 51/240 Test  #51: TestOpenCLCMMotionRemoverDouble .................   Passed    7.50 sec
        Start  52: TestOpenCLCheckpointsSingle
 52/240 Test  #52: TestOpenCLCheckpointsSingle .....................   Passed   16.28 sec
        Start  53: TestOpenCLCheckpointsMixed
 53/240 Test  #53: TestOpenCLCheckpointsMixed ......................   Passed   16.73 sec
        Start  54: TestOpenCLCheckpointsDouble
 54/240 Test  #54: TestOpenCLCheckpointsDouble .....................   Passed   17.47 sec
        Start  55: TestOpenCLCompoundIntegratorSingle
 55/240 Test  #55: TestOpenCLCompoundIntegratorSingle ..............   Passed   15.96 sec
        Start  56: TestOpenCLCompoundIntegratorMixed
 56/240 Test  #56: TestOpenCLCompoundIntegratorMixed ...............   Passed   15.75 sec
        Start  57: TestOpenCLCompoundIntegratorDouble
 57/240 Test  #57: TestOpenCLCompoundIntegratorDouble ..............   Passed   15.78 sec
        Start  58: TestOpenCLCustomAngleForceSingle
 58/240 Test  #58: TestOpenCLCustomAngleForceSingle ................   Passed   17.62 sec
        Start  59: TestOpenCLCustomAngleForceMixed
 59/240 Test  #59: TestOpenCLCustomAngleForceMixed .................   Passed   17.39 sec
        Start  60: TestOpenCLCustomAngleForceDouble
 60/240 Test  #60: TestOpenCLCustomAngleForceDouble ................   Passed   17.24 sec
        Start  61: TestOpenCLCustomBondForceSingle
 61/240 Test  #61: TestOpenCLCustomBondForceSingle .................   Passed   16.23 sec
        Start  62: TestOpenCLCustomBondForceMixed
 62/240 Test  #62: TestOpenCLCustomBondForceMixed ..................   Passed   17.01 sec
        Start  63: TestOpenCLCustomBondForceDouble
 63/240 Test  #63: TestOpenCLCustomBondForceDouble .................   Passed   17.86 sec
        Start  64: TestOpenCLCustomCentroidBondForceSingle
 64/240 Test  #64: TestOpenCLCustomCentroidBondForceSingle .........***Failed    1.77 sec
        Start  65: TestOpenCLCustomCentroidBondForceMixed
 65/240 Test  #65: TestOpenCLCustomCentroidBondForceMixed ..........***Failed    1.88 sec
        Start  66: TestOpenCLCustomCentroidBondForceDouble
 66/240 Test  #66: TestOpenCLCustomCentroidBondForceDouble .........***Failed    1.88 sec
        Start  67: TestOpenCLCustomCompoundBondForceSingle
 67/240 Test  #67: TestOpenCLCustomCompoundBondForceSingle .........   Passed   29.99 sec
        Start  68: TestOpenCLCustomCompoundBondForceMixed
 68/240 Test  #68: TestOpenCLCustomCompoundBondForceMixed ..........   Passed   30.56 sec
        Start  69: TestOpenCLCustomCompoundBondForceDouble
 69/240 Test  #69: TestOpenCLCustomCompoundBondForceDouble .........   Passed   30.43 sec
        Start  70: TestOpenCLCustomExternalForceSingle
 70/240 Test  #70: TestOpenCLCustomExternalForceSingle .............   Passed   16.60 sec
        Start  71: TestOpenCLCustomExternalForceMixed
 71/240 Test  #71: TestOpenCLCustomExternalForceMixed ..............   Passed   17.39 sec
        Start  72: TestOpenCLCustomExternalForceDouble
 72/240 Test  #72: TestOpenCLCustomExternalForceDouble .............   Passed   17.21 sec
        Start  73: TestOpenCLCustomGBForceSingle
 73/240 Test  #73: TestOpenCLCustomGBForceSingle ...................***Failed    6.53 sec
        Start  74: TestOpenCLCustomGBForceMixed
 74/240 Test  #74: TestOpenCLCustomGBForceMixed ....................***Failed    6.64 sec
        Start  75: TestOpenCLCustomGBForceDouble
 75/240 Test  #75: TestOpenCLCustomGBForceDouble ...................***Failed    2.78 sec
        Start  76: TestOpenCLCustomHbondForceSingle
 76/240 Test  #76: TestOpenCLCustomHbondForceSingle ................   Passed   13.35 sec
        Start  77: TestOpenCLCustomHbondForceMixed
 77/240 Test  #77: TestOpenCLCustomHbondForceMixed .................   Passed   14.23 sec
        Start  78: TestOpenCLCustomHbondForceDouble
 78/240 Test  #78: TestOpenCLCustomHbondForceDouble ................   Passed   14.51 sec
        Start  79: TestOpenCLCustomIntegratorSingle
 79/240 Test  #79: TestOpenCLCustomIntegratorSingle ................***Failed  101.23 sec
        Start  80: TestOpenCLCustomIntegratorMixed
 80/240 Test  #80: TestOpenCLCustomIntegratorMixed .................***Failed  103.46 sec
        Start  81: TestOpenCLCustomIntegratorDouble
 81/240 Test  #81: TestOpenCLCustomIntegratorDouble ................   Passed  170.12 sec
        Start  82: TestOpenCLCustomManyParticleForceSingle
 82/240 Test  #82: TestOpenCLCustomManyParticleForceSingle .........***Failed    1.76 sec
        Start  83: TestOpenCLCustomManyParticleForceMixed
 83/240 Test  #83: TestOpenCLCustomManyParticleForceMixed ..........***Failed    1.84 sec
        Start  84: TestOpenCLCustomManyParticleForceDouble
 84/240 Test  #84: TestOpenCLCustomManyParticleForceDouble .........***Failed    1.81 sec
        Start  85: TestOpenCLCustomNonbondedForceSingle
 85/240 Test  #85: TestOpenCLCustomNonbondedForceSingle ............   Passed   90.00 sec
        Start  86: TestOpenCLCustomNonbondedForceMixed
 86/240 Test  #86: TestOpenCLCustomNonbondedForceMixed .............   Passed   93.10 sec
        Start  87: TestOpenCLCustomNonbondedForceDouble
 87/240 Test  #87: TestOpenCLCustomNonbondedForceDouble ............   Passed   92.93 sec
        Start  88: TestOpenCLCustomTorsionForceSingle
 88/240 Test  #88: TestOpenCLCustomTorsionForceSingle ..............   Passed   19.41 sec
        Start  89: TestOpenCLCustomTorsionForceMixed
 89/240 Test  #89: TestOpenCLCustomTorsionForceMixed ...............   Passed   20.53 sec
        Start  90: TestOpenCLCustomTorsionForceDouble
 90/240 Test  #90: TestOpenCLCustomTorsionForceDouble ..............   Passed   20.78 sec
        Start  91: TestOpenCLDeviceQuerySingle
 91/240 Test  #91: TestOpenCLDeviceQuerySingle .....................   Passed    0.05 sec
        Start  92: TestOpenCLDeviceQueryMixed
 92/240 Test  #92: TestOpenCLDeviceQueryMixed ......................   Passed    0.05 sec
        Start  93: TestOpenCLDeviceQueryDouble
 93/240 Test  #93: TestOpenCLDeviceQueryDouble .....................   Passed    0.04 sec
        Start  94: TestOpenCLDispersionPMESingle
 94/240 Test  #94: TestOpenCLDispersionPMESingle ...................***Failed    9.86 sec
        Start  95: TestOpenCLDispersionPMEMixed
 95/240 Test  #95: TestOpenCLDispersionPMEMixed ....................***Failed    9.67 sec
        Start  96: TestOpenCLDispersionPMEDouble
 96/240 Test  #96: TestOpenCLDispersionPMEDouble ...................***Failed  297.77 sec
        Start  97: TestOpenCLEwaldSingle
 97/240 Test  #97: TestOpenCLEwaldSingle ...........................***Failed    3.95 sec
        Start  98: TestOpenCLEwaldMixed
 98/240 Test  #98: TestOpenCLEwaldMixed ............................***Failed    3.90 sec
        Start  99: TestOpenCLEwaldDouble
 99/240 Test  #99: TestOpenCLEwaldDouble ...........................   Passed  385.91 sec
        Start 100: TestOpenCLFFTSingle
100/240 Test #100: TestOpenCLFFTSingle .............................   Passed   21.65 sec
        Start 101: TestOpenCLFFTMixed
101/240 Test #101: TestOpenCLFFTMixed ..............................   Passed   21.13 sec
        Start 102: TestOpenCLFFTDouble
102/240 Test #102: TestOpenCLFFTDouble .............................   Passed   19.42 sec
        Start 103: TestOpenCLGBSAOBCForceSingle
103/240 Test #103: TestOpenCLGBSAOBCForceSingle ....................***Failed   26.95 sec
        Start 104: TestOpenCLGBSAOBCForceMixed
104/240 Test #104: TestOpenCLGBSAOBCForceMixed .....................***Failed   27.50 sec
        Start 105: TestOpenCLGBSAOBCForceDouble
105/240 Test #105: TestOpenCLGBSAOBCForceDouble ....................***Failed    3.30 sec
        Start 106: TestOpenCLGayBerneForceSingle
106/240 Test #106: TestOpenCLGayBerneForceSingle ...................***Failed    1.91 sec
        Start 107: TestOpenCLGayBerneForceMixed
107/240 Test #107: TestOpenCLGayBerneForceMixed ....................***Failed    1.90 sec
        Start 108: TestOpenCLGayBerneForceDouble
108/240 Test #108: TestOpenCLGayBerneForceDouble ...................***Failed    2.24 sec
        Start 109: TestOpenCLHarmonicAngleForceSingle
109/240 Test #109: TestOpenCLHarmonicAngleForceSingle ..............   Passed   10.79 sec
        Start 110: TestOpenCLHarmonicAngleForceMixed
110/240 Test #110: TestOpenCLHarmonicAngleForceMixed ...............   Passed   11.16 sec
        Start 111: TestOpenCLHarmonicAngleForceDouble
111/240 Test #111: TestOpenCLHarmonicAngleForceDouble ..............   Passed   11.12 sec
        Start 112: TestOpenCLHarmonicBondForceSingle
112/240 Test #112: TestOpenCLHarmonicBondForceSingle ...............   Passed   10.93 sec
        Start 113: TestOpenCLHarmonicBondForceMixed
113/240 Test #113: TestOpenCLHarmonicBondForceMixed ................   Passed   11.38 sec
        Start 114: TestOpenCLHarmonicBondForceDouble
114/240 Test #114: TestOpenCLHarmonicBondForceDouble ...............   Passed   11.27 sec
        Start 115: TestOpenCLLangevinIntegratorSingle
115/240 Test #115: TestOpenCLLangevinIntegratorSingle ..............   Passed   33.99 sec
        Start 116: TestOpenCLLangevinIntegratorMixed
116/240 Test #116: TestOpenCLLangevinIntegratorMixed ...............   Passed   36.46 sec
        Start 117: TestOpenCLLangevinIntegratorDouble
117/240 Test #117: TestOpenCLLangevinIntegratorDouble ..............   Passed   40.69 sec
        Start 118: TestOpenCLLocalEnergyMinimizerSingle
118/240 Test #118: TestOpenCLLocalEnergyMinimizerSingle ............   Passed   12.50 sec
        Start 119: TestOpenCLLocalEnergyMinimizerMixed
119/240 Test #119: TestOpenCLLocalEnergyMinimizerMixed .............   Passed   11.54 sec
        Start 120: TestOpenCLLocalEnergyMinimizerDouble
120/240 Test #120: TestOpenCLLocalEnergyMinimizerDouble ............   Passed   14.68 sec
        Start 121: TestOpenCLMonteCarloAnisotropicBarostatSingle
121/240 Test #121: TestOpenCLMonteCarloAnisotropicBarostatSingle ...   Passed  116.50 sec
        Start 122: TestOpenCLMonteCarloAnisotropicBarostatMixed
122/240 Test #122: TestOpenCLMonteCarloAnisotropicBarostatMixed ....   Passed  146.31 sec
        Start 123: TestOpenCLMonteCarloAnisotropicBarostatDouble
123/240 Test #123: TestOpenCLMonteCarloAnisotropicBarostatDouble ...   Passed  113.56 sec
        Start 124: TestOpenCLMonteCarloBarostatSingle
124/240 Test #124: TestOpenCLMonteCarloBarostatSingle ..............   Passed   48.00 sec
        Start 125: TestOpenCLMonteCarloBarostatMixed
125/240 Test #125: TestOpenCLMonteCarloBarostatMixed ...............   Passed   47.87 sec
        Start 126: TestOpenCLMonteCarloBarostatDouble
126/240 Test #126: TestOpenCLMonteCarloBarostatDouble ..............   Passed   56.97 sec
        Start 127: TestOpenCLMultipleForcesSingle
127/240 Test #127: TestOpenCLMultipleForcesSingle ..................   Passed    3.27 sec
        Start 128: TestOpenCLMultipleForcesMixed
128/240 Test #128: TestOpenCLMultipleForcesMixed ...................   Passed    3.10 sec
        Start 129: TestOpenCLMultipleForcesDouble
129/240 Test #129: TestOpenCLMultipleForcesDouble ..................   Passed    3.18 sec
        Start 130: TestOpenCLNonbondedForceSingle
130/240 Test #130: TestOpenCLNonbondedForceSingle ..................***Failed   82.90 sec
        Start 131: TestOpenCLNonbondedForceMixed
131/240 Test #131: TestOpenCLNonbondedForceMixed ...................***Failed   84.31 sec
        Start 132: TestOpenCLNonbondedForceDouble
132/240 Test #132: TestOpenCLNonbondedForceDouble ..................   Passed  134.14 sec
        Start 133: TestOpenCLPeriodicTorsionForceSingle
133/240 Test #133: TestOpenCLPeriodicTorsionForceSingle ............   Passed   12.01 sec
        Start 134: TestOpenCLPeriodicTorsionForceMixed
134/240 Test #134: TestOpenCLPeriodicTorsionForceMixed .............   Passed   12.29 sec
        Start 135: TestOpenCLPeriodicTorsionForceDouble
135/240 Test #135: TestOpenCLPeriodicTorsionForceDouble ............   Passed   12.18 sec
        Start 136: TestOpenCLRBTorsionForceSingle
136/240 Test #136: TestOpenCLRBTorsionForceSingle ..................   Passed   11.81 sec
        Start 137: TestOpenCLRBTorsionForceMixed
137/240 Test #137: TestOpenCLRBTorsionForceMixed ...................   Passed   12.18 sec
        Start 138: TestOpenCLRBTorsionForceDouble
138/240 Test #138: TestOpenCLRBTorsionForceDouble ..................   Passed   12.11 sec
        Start 139: TestOpenCLRandomSingle
139/240 Test #139: TestOpenCLRandomSingle ..........................   Passed    8.79 sec
        Start 140: TestOpenCLRandomMixed
140/240 Test #140: TestOpenCLRandomMixed ...........................   Passed    8.67 sec
        Start 141: TestOpenCLRandomDouble
141/240 Test #141: TestOpenCLRandomDouble ..........................   Passed    8.67 sec
        Start 142: TestOpenCLSettleSingle
142/240 Test #142: TestOpenCLSettleSingle ..........................   Passed    3.55 sec
        Start 143: TestOpenCLSettleMixed
143/240 Test #143: TestOpenCLSettleMixed ...........................   Passed    3.80 sec
        Start 144: TestOpenCLSettleDouble
144/240 Test #144: TestOpenCLSettleDouble ..........................   Passed    4.23 sec
        Start 145: TestOpenCLSortSingle
145/240 Test #145: TestOpenCLSortSingle ............................   Passed    6.27 sec
        Start 146: TestOpenCLSortMixed
146/240 Test #146: TestOpenCLSortMixed .............................   Passed    6.47 sec
        Start 147: TestOpenCLSortDouble
147/240 Test #147: TestOpenCLSortDouble ............................   Passed    6.37 sec
        Start 148: TestOpenCLVariableLangevinIntegratorSingle
148/240 Test #148: TestOpenCLVariableLangevinIntegratorSingle ......   Passed   45.85 sec
        Start 149: TestOpenCLVariableLangevinIntegratorMixed
149/240 Test #149: TestOpenCLVariableLangevinIntegratorMixed .......   Passed   47.18 sec
        Start 150: TestOpenCLVariableLangevinIntegratorDouble
150/240 Test #150: TestOpenCLVariableLangevinIntegratorDouble ......   Passed   55.67 sec
        Start 151: TestOpenCLVariableVerletIntegratorSingle
151/240 Test #151: TestOpenCLVariableVerletIntegratorSingle ........   Passed   19.48 sec
        Start 152: TestOpenCLVariableVerletIntegratorMixed
152/240 Test #152: TestOpenCLVariableVerletIntegratorMixed .........   Passed   20.78 sec
        Start 153: TestOpenCLVariableVerletIntegratorDouble
153/240 Test #153: TestOpenCLVariableVerletIntegratorDouble ........   Passed   25.14 sec
        Start 154: TestOpenCLVerletIntegratorSingle
154/240 Test #154: TestOpenCLVerletIntegratorSingle ................   Passed   19.59 sec
        Start 155: TestOpenCLVerletIntegratorMixed
155/240 Test #155: TestOpenCLVerletIntegratorMixed .................   Passed   17.43 sec
        Start 156: TestOpenCLVerletIntegratorDouble
156/240 Test #156: TestOpenCLVerletIntegratorDouble ................   Passed   18.54 sec
        Start 157: TestOpenCLVirtualSitesSingle
157/240 Test #157: TestOpenCLVirtualSitesSingle ....................   Passed   27.15 sec
        Start 158: TestOpenCLVirtualSitesMixed
158/240 Test #158: TestOpenCLVirtualSitesMixed .....................   Passed   28.82 sec
        Start 159: TestOpenCLVirtualSitesDouble
159/240 Test #159: TestOpenCLVirtualSitesDouble ....................***Failed   22.83 sec
        Start 160: TestCpuCheckpoints
160/240 Test #160: TestCpuCheckpoints ..............................   Passed    0.12 sec
        Start 161: TestCpuCompoundIntegrator
161/240 Test #161: TestCpuCompoundIntegrator .......................   Passed    2.91 sec
        Start 162: TestCpuCustomGBForce
162/240 Test #162: TestCpuCustomGBForce ............................   Passed    0.51 sec
        Start 163: TestCpuCustomManyParticleForce
163/240 Test #163: TestCpuCustomManyParticleForce ..................   Passed   45.28 sec
        Start 164: TestCpuCustomNonbondedForce
164/240 Test #164: TestCpuCustomNonbondedForce .....................   Passed    0.84 sec
        Start 165: TestCpuDispersionPME
165/240 Test #165: TestCpuDispersionPME ............................   Passed    9.17 sec
        Start 166: TestCpuEwald
166/240 Test #166: TestCpuEwald ....................................   Passed    5.09 sec
        Start 167: TestCpuGBSAOBCForce
167/240 Test #167: TestCpuGBSAOBCForce .............................   Passed    3.26 sec
        Start 168: TestCpuGayBerneForce
168/240 Test #168: TestCpuGayBerneForce ............................   Passed    0.29 sec
        Start 169: TestCpuHarmonicAngleForce
169/240 Test #169: TestCpuHarmonicAngleForce .......................   Passed    0.01 sec
        Start 170: TestCpuLangevinIntegrator
170/240 Test #170: TestCpuLangevinIntegrator .......................   Passed    5.49 sec
        Start 171: TestCpuNeighborList
171/240 Test #171: TestCpuNeighborList .............................   Passed    0.51 sec
        Start 172: TestCpuNonbondedForce
172/240 Test #172: TestCpuNonbondedForce ...........................   Passed    1.40 sec
        Start 173: TestCpuPeriodicTorsionForce
173/240 Test #173: TestCpuPeriodicTorsionForce .....................   Passed    0.01 sec
        Start 174: TestCpuRBTorsionForce
174/240 Test #174: TestCpuRBTorsionForce ...........................   Passed    0.01 sec
        Start 175: TestCpuSettle
175/240 Test #175: TestCpuSettle ...................................   Passed    0.44 sec
        Start 176: TestReferenceAmoebaAngleForce
176/240 Test #176: TestReferenceAmoebaAngleForce ...................   Passed    0.07 sec
        Start 177: TestReferenceAmoebaBondForce
177/240 Test #177: TestReferenceAmoebaBondForce ....................   Passed    0.02 sec
        Start 178: TestReferenceAmoebaExtrapolatedPolarization
178/240 Test #178: TestReferenceAmoebaExtrapolatedPolarization .....   Passed    2.93 sec
        Start 179: TestReferenceAmoebaGeneralizedKirkwoodForce
179/240 Test #179: TestReferenceAmoebaGeneralizedKirkwoodForce .....   Passed   35.61 sec
        Start 180: TestReferenceAmoebaInPlaneAngleForce
180/240 Test #180: TestReferenceAmoebaInPlaneAngleForce ............   Passed    0.02 sec
        Start 181: TestReferenceAmoebaMultipoleForce
181/240 Test #181: TestReferenceAmoebaMultipoleForce ...............   Passed    4.07 sec
        Start 182: TestReferenceAmoebaOutOfPlaneBendForce
182/240 Test #182: TestReferenceAmoebaOutOfPlaneBendForce ..........   Passed    0.08 sec
        Start 183: TestReferenceAmoebaPiTorsionForce
183/240 Test #183: TestReferenceAmoebaPiTorsionForce ...............   Passed    0.01 sec
        Start 184: TestReferenceAmoebaStretchBendForce
184/240 Test #184: TestReferenceAmoebaStretchBendForce .............   Passed    0.02 sec
        Start 185: TestReferenceAmoebaTorsionTorsionForce
185/240 Test #185: TestReferenceAmoebaTorsionTorsionForce ..........   Passed    0.01 sec
        Start 186: TestReferenceAmoebaVdwForce
186/240 Test #186: TestReferenceAmoebaVdwForce .....................   Passed    0.44 sec
        Start 187: TestReferenceWcaDispersionForce
187/240 Test #187: TestReferenceWcaDispersionForce .................   Passed    0.01 sec
        Start 188: TestReferenceRpmd
188/240 Test #188: TestReferenceRpmd ...............................   Passed  113.22 sec
        Start 189: TestOpenCLRpmdSingle
189/240 Test #189: TestOpenCLRpmdSingle ............................   Passed  214.70 sec
        Start 190: TestOpenCLRpmdMixed
190/240 Test #190: TestOpenCLRpmdMixed .............................   Passed  230.66 sec
        Start 191: TestOpenCLRpmdDouble
191/240 Test #191: TestOpenCLRpmdDouble ............................   Passed  405.49 sec
        Start 192: TestReferenceDrudeForce
192/240 Test #192: TestReferenceDrudeForce .........................   Passed    0.23 sec
        Start 193: TestReferenceDrudeLangevinIntegrator
193/240 Test #193: TestReferenceDrudeLangevinIntegrator ............   Passed   39.73 sec
        Start 194: TestReferenceDrudeSCFIntegrator
194/240 Test #194: TestReferenceDrudeSCFIntegrator .................   Passed   56.42 sec
        Start 195: TestOpenCLDrudeForceSingle
195/240 Test #195: TestOpenCLDrudeForceSingle ......................   Passed    9.63 sec
        Start 196: TestOpenCLDrudeForceMixed
196/240 Test #196: TestOpenCLDrudeForceMixed .......................   Passed    9.33 sec
        Start 197: TestOpenCLDrudeForceDouble
197/240 Test #197: TestOpenCLDrudeForceDouble ......................   Passed    9.41 sec
        Start 198: TestOpenCLDrudeLangevinIntegratorSingle
198/240 Test #198: TestOpenCLDrudeLangevinIntegratorSingle .........***Failed   43.85 sec
        Start 199: TestOpenCLDrudeLangevinIntegratorMixed
199/240 Test #199: TestOpenCLDrudeLangevinIntegratorMixed ..........***Failed   44.75 sec
        Start 200: TestOpenCLDrudeLangevinIntegratorDouble
200/240 Test #200: TestOpenCLDrudeLangevinIntegratorDouble .........   Passed   61.38 sec
        Start 201: TestOpenCLDrudeSCFIntegratorSingle
201/240 Test #201: TestOpenCLDrudeSCFIntegratorSingle ..............   Passed   26.18 sec
        Start 202: TestOpenCLDrudeSCFIntegratorMixed
202/240 Test #202: TestOpenCLDrudeSCFIntegratorMixed ...............   Passed   25.53 sec
        Start 203: TestOpenCLDrudeSCFIntegratorDouble
203/240 Test #203: TestOpenCLDrudeSCFIntegratorDouble ..............   Passed   20.63 sec
        Start 204: TestCpuPme
204/240 Test #204: TestCpuPme ......................................   Passed    0.92 sec
        Start 205: TestSerializationNode
205/240 Test #205: TestSerializationNode ...........................   Passed    0.05 sec
        Start 206: TestSerializeAndersenThermostat
206/240 Test #206: TestSerializeAndersenThermostat .................   Passed    0.03 sec
        Start 207: TestSerializeCMAPTorsion
207/240 Test #207: TestSerializeCMAPTorsion ........................   Passed    0.03 sec
        Start 208: TestSerializeCMMotionRemover
208/240 Test #208: TestSerializeCMMotionRemover ....................   Passed    0.05 sec
        Start 209: TestSerializeCustomAngleForce
209/240 Test #209: TestSerializeCustomAngleForce ...................   Passed    0.06 sec
        Start 210: TestSerializeCustomBondForce
210/240 Test #210: TestSerializeCustomBondForce ....................   Passed    0.06 sec
        Start 211: TestSerializeCustomCentroidBondForce
211/240 Test #211: TestSerializeCustomCentroidBondForce ............   Passed    0.04 sec
        Start 212: TestSerializeCustomCompoundBondForce
212/240 Test #212: TestSerializeCustomCompoundBondForce ............   Passed    0.05 sec
        Start 213: TestSerializeCustomExternalForce
213/240 Test #213: TestSerializeCustomExternalForce ................   Passed    0.00 sec
        Start 214: TestSerializeCustomGBForce
214/240 Test #214: TestSerializeCustomGBForce ......................   Passed    0.03 sec
        Start 215: TestSerializeCustomHbondForce
215/240 Test #215: TestSerializeCustomHbondForce ...................   Passed    0.01 sec
        Start 216: TestSerializeCustomManyParticleForce
216/240 Test #216: TestSerializeCustomManyParticleForce ............   Passed    0.00 sec
        Start 217: TestSerializeCustomNonbondedForce
217/240 Test #217: TestSerializeCustomNonbondedForce ...............   Passed    0.01 sec
        Start 218: TestSerializeCustomTorsionForce
218/240 Test #218: TestSerializeCustomTorsionForce .................   Passed    0.04 sec
        Start 219: TestSerializeGBSAOBCForce
219/240 Test #219: TestSerializeGBSAOBCForce .......................   Passed    0.03 sec
        Start 220: TestSerializeGayBerneForce
220/240 Test #220: TestSerializeGayBerneForce ......................   Passed    0.00 sec
        Start 221: TestSerializeHarmonicAngleForce
221/240 Test #221: TestSerializeHarmonicAngleForce .................   Passed    0.00 sec
        Start 222: TestSerializeHarmonicBondForce
222/240 Test #222: TestSerializeHarmonicBondForce ..................   Passed    0.00 sec
        Start 223: TestSerializeIntegrator
223/240 Test #223: TestSerializeIntegrator .........................   Passed    0.01 sec
        Start 224: TestSerializeMonteCarloAnisotropicBarostat
224/240 Test #224: TestSerializeMonteCarloAnisotropicBarostat ......   Passed    0.05 sec
        Start 225: TestSerializeMonteCarloBarostat
225/240 Test #225: TestSerializeMonteCarloBarostat .................   Passed    0.05 sec
        Start 226: TestSerializeMonteCarloMembraneBarostat
226/240 Test #226: TestSerializeMonteCarloMembraneBarostat .........   Passed    0.04 sec
        Start 227: TestSerializeNonbondedForce
227/240 Test #227: TestSerializeNonbondedForce .....................   Passed    0.01 sec
        Start 228: TestSerializePeriodicTorsionForce
228/240 Test #228: TestSerializePeriodicTorsionForce ...............   Passed    0.01 sec
        Start 229: TestSerializeRBTorsionForce
229/240 Test #229: TestSerializeRBTorsionForce .....................   Passed    0.01 sec
        Start 230: TestSerializeState
230/240 Test #230: TestSerializeState ..............................   Passed    0.16 sec
        Start 231: TestSerializeSystem
231/240 Test #231: TestSerializeSystem .............................   Passed    0.02 sec
        Start 232: TestSerializeTabulatedFunctions
232/240 Test #232: TestSerializeTabulatedFunctions .................   Passed    0.01 sec
        Start 233: TestEnforcePeriodicBox
233/240 Test #233: TestEnforcePeriodicBox ..........................   Passed    0.01 sec
        Start 234: TestFindExclusions
234/240 Test #234: TestFindExclusions ..............................   Passed    0.01 sec
        Start 235: TestFindMolecules
235/240 Test #235: TestFindMolecules ...............................   Passed    0.02 sec
        Start 236: TestParser
236/240 Test #236: TestParser ......................................   Passed    0.08 sec
        Start 237: TestSplineFitter
237/240 Test #237: TestSplineFitter ................................   Passed    0.01 sec
        Start 238: TestSystem
238/240 Test #238: TestSystem ......................................   Passed    0.00 sec
        Start 239: TestVectorize
239/240 Test #239: TestVectorize ...................................   Passed    0.00 sec
        Start 240: TestVectorize8
240/240 Test #240: TestVectorize8 ..................................   Passed    0.04 sec

89% tests passed, 27 tests failed out of 240

Total Test time (real) = 5611.06 sec

The following tests FAILED:
	 64 - TestOpenCLCustomCentroidBondForceSingle (Failed)
	 65 - TestOpenCLCustomCentroidBondForceMixed (Failed)
	 66 - TestOpenCLCustomCentroidBondForceDouble (Failed)
	 73 - TestOpenCLCustomGBForceSingle (Failed)
	 74 - TestOpenCLCustomGBForceMixed (Failed)
	 75 - TestOpenCLCustomGBForceDouble (Failed)
	 79 - TestOpenCLCustomIntegratorSingle (Failed)
	 80 - TestOpenCLCustomIntegratorMixed (Failed)
	 82 - TestOpenCLCustomManyParticleForceSingle (Failed)
	 83 - TestOpenCLCustomManyParticleForceMixed (Failed)
	 84 - TestOpenCLCustomManyParticleForceDouble (Failed)
	 94 - TestOpenCLDispersionPMESingle (Failed)
	 95 - TestOpenCLDispersionPMEMixed (Failed)
	 96 - TestOpenCLDispersionPMEDouble (Failed)
	 97 - TestOpenCLEwaldSingle (Failed)
	 98 - TestOpenCLEwaldMixed (Failed)
	103 - TestOpenCLGBSAOBCForceSingle (Failed)
	104 - TestOpenCLGBSAOBCForceMixed (Failed)
	105 - TestOpenCLGBSAOBCForceDouble (Failed)
	106 - TestOpenCLGayBerneForceSingle (Failed)
	107 - TestOpenCLGayBerneForceMixed (Failed)
	108 - TestOpenCLGayBerneForceDouble (Failed)
	130 - TestOpenCLNonbondedForceSingle (Failed)
	131 - TestOpenCLNonbondedForceMixed (Failed)
	159 - TestOpenCLVirtualSitesDouble (Failed)
	198 - TestOpenCLDrudeLangevinIntegratorSingle (Failed)
	199 - TestOpenCLDrudeLangevinIntegratorMixed (Failed)
Errors while running CTest
Makefile:127: recipe for target 'test' failed
make: *** [test] Error 8

These depend on bug 99950 getting fixed.
Comment 4 Jan Vesely 2017-10-28 14:53:30 UTC
(In reply to Vedran Miletić from comment #1)
> With https://reviews.llvm.org/D29942 and trivially defined native_recip() in
> libclc more tests pass, but still not all of them.

a libclc workaround to D29942 was added in r316587 and r316588 native recip was added in r313107.
Comment 5 Jan Vesely 2018-06-21 03:32:47 UTC
86% tests passed, 36 tests failed out of 263

Total Test time (real) = 17694.20 sec

The following tests FAILED:
	 42 - TestOpenCLAndersenThermostatSingle (SEGFAULT)
	 43 - TestOpenCLAndersenThermostatMixed (SEGFAULT)
	 44 - TestOpenCLAndersenThermostatDouble (SEGFAULT)
	 45 - TestOpenCLBrownianIntegratorSingle (SEGFAULT)
	 46 - TestOpenCLBrownianIntegratorMixed (SEGFAULT)
	 47 - TestOpenCLBrownianIntegratorDouble (SEGFAULT)
	 78 - TestOpenCLCustomGBForceSingle (Failed)
	 79 - TestOpenCLCustomGBForceMixed (Failed)
	 80 - TestOpenCLCustomGBForceDouble (Failed)
	 84 - TestOpenCLCustomIntegratorSingle (Failed)
	 85 - TestOpenCLCustomIntegratorMixed (Failed)
	 86 - TestOpenCLCustomIntegratorDouble (Failed)
	 89 - TestOpenCLCustomManyParticleForceDouble (Timeout)
	111 - TestOpenCLGayBerneForceSingle (Failed)
	112 - TestOpenCLGayBerneForceMixed (Failed)
	113 - TestOpenCLGayBerneForceDouble (Failed)
	120 - TestOpenCLLangevinIntegratorSingle (SEGFAULT)
	121 - TestOpenCLLangevinIntegratorMixed (SEGFAULT)
	122 - TestOpenCLLangevinIntegratorDouble (SEGFAULT)
	147 - TestOpenCLRandomSingle (Failed)
	148 - TestOpenCLRandomMixed (Failed)
	149 - TestOpenCLRandomDouble (Failed)
	156 - TestOpenCLVariableLangevinIntegratorSingle (Failed)
	157 - TestOpenCLVariableLangevinIntegratorMixed (Failed)
	158 - TestOpenCLVariableLangevinIntegratorDouble (Failed)
	159 - TestOpenCLVariableVerletIntegratorSingle (Failed)
	160 - TestOpenCLVariableVerletIntegratorMixed (Failed)
	161 - TestOpenCLVariableVerletIntegratorDouble (Failed)
	163 - TestOpenCLVerletIntegratorMixed (Failed)
	164 - TestOpenCLVerletIntegratorDouble (Failed)
	208 - TestOpenCLRpmdSingle (SEGFAULT)
	209 - TestOpenCLRpmdMixed (SEGFAULT)
	210 - TestOpenCLRpmdDouble (SEGFAULT)
	217 - TestOpenCLDrudeLangevinIntegratorSingle (SEGFAULT)
	218 - TestOpenCLDrudeLangevinIntegratorMixed (SEGFAULT)
	219 - TestOpenCLDrudeLangevinIntegratorDouble (SEGFAULT)


Use of freedesktop.org services, including Bugzilla, is subject to our Code of Conduct. How we collect and use information is described in our Privacy Policy.